{"text_format":"1","workbook":"xlsx","n_sheets":10,"sheets":["1) INPUT BASE","2) INPUT INVESTIMENTI","3) INPUT VENDITE","4) INPUT INPS","5) INPUT COSTI FISSI","6) INPUT COSTI VARIABILI","7) INPUT FINANZIAMENTO","8) OUTPUT TASSAZIONE","9) OUTPUT FLUSSI DI CASSA","10) OUTPUT RIEPILOGO"],"not_rendered":{"charts":0,"images":0,"macros":1,"external_links":0,"defined_names":11,"comments":8,"pivot_tables":0},"unopened":[],"bounds":{"document_bytes":16777216,"sheet_cells":100000,"rows_first":2000,"rows_last":500,"rows_between":2000,"halvings":0,"cell_chars":16384,"cell_head_chars":4096},"cells_cut":0,"cells_raw":0,"read":"whole","date_system":"1900"}

{"sheet":"1) INPUT BASE","index":0,"n_rows":25,"n_cols":7,"rows_kept":25,"cut":false,"hidden":false,"merged":[[0,1,2,6],[3,1,3,6],[13,2,13,6]]}
[null,"Business plan di un BED & BREAKFAST / AFFITTACAMERE v1.0\ndel Dott. Gabriele Leone"]
[]
[]
[null,"INPUT DI BASE"]
[null,"TIPO ATTIVITA'","B&B NO IMPRENDITORIALE",null,null,"REDDITO LIMITE",50000]
[null,"NOME DITTA","B&B LEONE",null,null,"% DI REDDITIVITA'",0.4]
[null,"NOME / COGNOME TITOLARE","GABRIELE LEONE",null,null,"ALIQUOTA IMPOSTE",0.05]
[null,"CODICE FISCALE"]
[null,"P.IVA"]
[null,"REA"]
[null,"ANNO INIZIO BUSINESS PLAN",2016]
[null,"MESE INIZIO BUSINESS PLAN",4]
[]
[null,null,"PREZZI UNITARI SERVIZI"]
[null,null,"N. STANZE","ALTA STAGIONE","MEDIA STAGIONE","BASSA STAGIONE","NOTE"]
[null,"CAMERE QUADRUPLE",0,0,0,0]
[null,"CAMERE TRIPLE",0,0,0,0]
[null,"CAMERE DOPPIE",2,90,70,50]
[null,"CAMERE SINGOLE"]
[null,"VISITE GUIDATE"]
[null,"Altri ricavi"]
[null,"Altri ricavi"]
[null,"Altri ricavi"]
[null,"Altri ricavi"]
[null,"Altri ricavi"]

{"sheet":"2) INPUT INVESTIMENTI","index":1,"n_rows":59,"n_cols":13,"rows_kept":59,"cut":false,"hidden":false,"merged":[[0,0,2,12],[7,1,7,12],[19,1,19,12],[4,0,6,0],[3,0,3,12],[4,1,5,4],[4,5,5,8],[4,9,5,12]]}
[{"$f":"+'9) OUTPUT FLUSSI DI CASSA'!A1","v":"BUSINESS PLAN PER L'EXTRALBERGHIERO"}]
[]
[]
["PIANO INVESTIMENTI"]
["INVESTIMENTI","ANNO 1",null,null,null,"ANNO 2",null,null,null,"ANNO 3"]
[]
[null,"N.","Importo unitario","Importo","Ammort. annuo (euro)","N.","Importo unitario","Importo","Ammort. annuo (euro)","N.","Importo unitario","Importo","Ammort. annuo (euro)"]
["Investimenti immateriali"]
["Costi di costituzione",null,null,500,{"$f":"+D9","v":500},null,null,0,{"$f":"+H9","v":0},null,null,0,{"$f":"+L9","v":0}]
["Sito internet",null,null,600,{"$f":"+D10","v":600},null,null,0,{"$f":"+H10","v":0},null,null,0,{"$f":"+L10","v":0}]
["Elaborazione business plan",null,null,0,0,null,null,0,0,null,null,0,0]
["Promozione pre avvio",null,null,1000,1000,null,null,0,0,null,null,0,0]
["Altri investimenti immateriali",null,null,0,0,null,null,0,0,null,null,0,0]
["Altri investimenti immateriali",null,null,0,0,null,null,0,0,null,null,0,0]
["Altri investimenti immateriali",null,null,0,0,null,null,0,0,null,null,0,0]
["Altri investimenti immateriali",null,null,0,0,null,null,0,0,null,null,0,0]
["Altri investimenti immateriali",null,null,0,0,null,null,0,0,null,null,0,0]
["Altri investimenti immateriali",null,null,0,0,null,null,0,0,null,null,0,0]
["Altri investimenti immateriali",null,null,0,0,null,null,0,0,null,null,0,0]
["Investimenti materiali"]
["Insegne/targhe",1,150,{"$f":"+C21*B21","v":150},{"$f":"+D21","v":150},1,0,{"$f":"+G21*F21","v":0},{"$f":"+H21","v":0},1,0,{"$f":"+K21*J21","v":0},{"$f":"+L21","v":0}]
["Ristrutturazioni",null,null,0,0,null,null,0,0,null,null,0,0]
["Impianto climatizzazione",null,null,2000,2000,null,null,0,0,null,null,0,0]
["Impianto riscaldamenti",null,null,0,0,null,null,0,0,null,null,0,0]
["Arredo camere",1,2000,{"$f":"+B25*C25","v":2000},2000,3,0,{"$f":"+F25*G25","v":0},0,3,0,{"$f":"+J25*K25","v":0},0]
["Arredo salotto",null,null,0,0,null,null,0,0,null,null,0,0]
["Arredo cortile/area esterna",null,null,0,0,null,null,0,0,null,null,0,0]
["Arredo cucina",null,null,0,0,null,null,0,0,null,null,0,0]
["Arredo servizi igienici",1,0,{"$f":"+C29*B29","v":0},0,2,0,{"$f":"+G29*F29","v":0},0,2,0,{"$f":"+K29*J29","v":0},0]
["Arredo ufficio/stanza titolare",null,null,0,0,null,null,0,0,null,null,0,0]
["Altro arredo locale",null,null,0,0,null,null,0,0,null,null,0,0]
["Cucina",null,null,0,0,null,null,0,0,null,null,0,0]
["Mobili cucina",null,null,0,0,null,null,0,0,null,null,0,0]
["Mobili cucina",null,null,0,0,null,null,0,0,null,null,0,0]
["Frigorifero",null,null,0,0,null,null,0,0,null,null,0,0]
["Altri elettrodomestici",null,null,0,0,null,null,0,0,null,null,0,0]
["Altri elettrodomestici",null,null,0,0,null,null,0,0,null,null,0,0]
["Altri elettrodomestici",null,null,0,0,null,null,0,0,null,null,0,0]
["Altri elettrodomestici",null,null,0,0,null,null,0,0,null,null,0,0]
["Utensili/Attrezzatura cucina",null,null,100,100,null,null,0,0,null,null,0,0]
["Biancheria per la casa",null,null,500,500,null,null,0,0,null,null,0,0]
["Strumenti per pulizia locali",1,0,{"$f":"+B42*C42","v":0},0,0,0,{"$f":"+F42*G42","v":0},0,0,0,{"$f":"+J42*K42","v":0},0]
["Telefono fisso",null,0,{"$f":"+B43*C43","v":0},0,0,0,{"$f":"+F43*G43","v":0},0,0,0,{"$f":"+J43*K43","v":0},0]
["Telefoni cellulari ",1,0,{"$f":"+B44*C44","v":0},0,1,0,{"$f":"+F44*G44","v":0},0,1,0,{"$f":"+J44*K44","v":0},0]
["Segreteria telefonica",null,null,50,50,null,null,0,0,null,null,0,0]
["Fax",null,null,0,0,null,null,0,0,null,null,0,0]
["Computer",1,500,{"$f":"+B47*C47","v":500},500,1,0,{"$f":"+F47*G47","v":0},0,1,0,{"$f":"+J47*K47","v":0},0]
["Software",1,100,{"$f":"+B48*C48","v":100},100,1,0,{"$f":"+F48*G48","v":0},0,1,0,{"$f":"+J48*K48","v":0},0]
["Stampante",null,null,100,100,null,null,0,0,null,null,0,0]
["Altre attrezzature",null,null,0,0,null,null,0,0,null,null,0,0]
["Altre attrezzature",null,null,0,0,null,null,0,0,null,null,0,0]
["Altre attrezzature",null,null,0,0,null,null,0,0,null,null,0,0]
["Altri investimenti materiali",null,null,0,0,null,null,0,0,null,null,0,0]
["Altri investimenti materiali",null,null,0,0,null,null,0,0,null,null,0,0]
["Altri investimenti materiali",null,null,0,0,null,null,0,0,null,null,0,0]
["Altri investimenti materiali",null,null,0,0,null,null,0,0,null,null,0,0]
["Altri investimenti materiali",null,null,0,0,null,null,0,0,null,null,0,0]
["TOTALE INVESTIMENTI",null,null,{"$f":"SUM(D9:D57)","v":7600},null,null,null,{"$f":"SUM(H9:H57)","v":0},null,null,null,{"$f":"SUM(L9:L57)","v":0}]
["TOTALE AMMORT. ANNUI",null,null,null,{"$f":"SUM(E9:E57)","v":7600},null,null,null,{"$f":"SUM(I9:I57)","v":0},null,null,null,{"$f":"SUM(M9:M57)","v":0}]

{"sheet":"3) INPUT VENDITE","index":2,"n_rows":49,"n_cols":82,"rows_kept":49,"cut":false,"hidden":false,"merged":[[38,13,47,13],[38,27,47,27],[38,41,47,41],[27,13,36,14],[27,27,36,28],[27,41,36,41],[37,1,37,12],[37,15,37,26],[37,29,37,40],[14,1,14,12],[14,15,14,26],[14,29,14,40],[1,41,2,41],[1,13,2,13],[1,14,2,14],[0,1,0,12],[0,15,0,26],[0,29,0,40],[1,27,2,27],[1,28,2,28]]}
["INPUT VENDITE","MESI",null,null,null,null,null,null,null,null,null,null,null,"ANNO 1",null,"MESI",null,null,null,null,null,null,null,null,null,null,null,"ANNO 2",null,"MESI",null,null,null,null,null,null,null,null,null,null,null,"ANNO 3",null,null,null,1,2,3,4,5,6,7,8,9,10,11,12,13,14,15,16,17,18,19,20,21,22,23,24,25,26,27,28,29,30,31,32,33,34,35,36]
["PIANO DEI RICAVI",{"$f":"EOMONTH(DATE('1) INPUT BASE'!C11,'1) INPUT BASE'!C12,1),0)","v":"2016-04-30"},{"$f":"+EOMONTH(B2,1)","v":"2016-05-31"},{"$f":"+EOMONTH(C2,1)","v":"2016-06-30"},"2016-07-31","2016-08-31","2016-09-30","2016-10-31","2016-11-30","2016-12-31","2017-01-31","2017-02-28","2017-03-31","TOTALE",null,{"$f":"+EOMONTH(M2,1)","v":"2017-04-30"},{"$f":"+EOMONTH(P2,1)","v":"2017-05-31"},{"$f":"+EOMONTH(Q2,1)","v":"2017-06-30"},"2017-07-31","2017-08-31","2017-09-30","2017-10-31","2017-11-30","2017-12-31","2018-01-31","2018-02-28",{"$f":"+EOMONTH(Z2,1)","v":"2018-03-31"},"TOTALE",null,{"$f":"+EOMONTH(AA2,1)","v":"2018-04-30"},{"$f":"+EOMONTH(AD2,1)","v":"2018-05-31"},{"$f":"+EOMONTH(AE2,1)","v":"2018-06-30"},"2018-07-31","2018-08-31","2018-09-30","2018-10-31","2018-11-30","2018-12-31","2019-01-31","2019-02-28","2019-03-31","TOTALE",null,null,"mesi",{"$f":"+B2","v":"2016-04-30"},{"$f":"+C2","v":"2016-05-31"},"2016-06-30","2016-07-31","2016-08-31","2016-09-30","2016-10-31",{"$f":"+I2","v":"2016-11-30"},{"$f":"+J2","v":"2016-12-31"},{"$f":"+K2","v":"2017-01-31"},{"$f":"+L2","v":"2017-02-28"},{"$f":"+M2","v":"2017-03-31"},{"$f":"+P2","v":"2017-04-30"},{"$f":"+Q2","v":"2017-05-31"},{"$f":"+R2","v":"2017-06-30"},{"$f":"+S2","v":"2017-07-31"},{"$f":"+T2","v":"2017-08-31"},{"$f":"+U2","v":"2017-09-30"},{"$f":"+V2","v":"2017-10-31"},{"$f":"+W2","v":"2017-11-30"},{"$f":"+X2","v":"2017-12-31"},{"$f":"+Y2","v":"2018-01-31"},{"$f":"+Z2","v":"2018-02-28"},{"$f":"+AA2","v":"2018-03-31"},{"$f":"+AD2","v":"2018-04-30"},{"$f":"+AE2","v":"2018-05-31"},{"$f":"+AF2","v":"2018-06-30"},{"$f":"+AG2","v":"2018-07-31"},{"$f":"+AH2","v":"2018-08-31"},{"$f":"+AI2","v":"2018-09-30"},{"$f":"+AJ2","v":"2018-10-31"},{"$f":"+AK2","v":"2018-11-30"},{"$f":"+AL2","v":"2018-12-31"},{"$f":"+AM2","v":"2019-01-31"},{"$f":"+AN2","v":"2019-02-28"},{"$f":"+AO2","v":"2019-03-31"}]
["STAGIONALITA' ->","BASSA","MEDIA","ALTA","ALTA","ALTA","MEDIA","BASSA","BASSA","ALTA","BASSA","BASSA","BASSA",null,null,{"$f":"+B3","v":"BASSA"},{"$f":"+C3","v":"MEDIA"},"ALTA","ALTA","ALTA","MEDIA","BASSA","BASSA","ALTA","BASSA","BASSA","BASSA",null,null,{"$f":"+P3","v":"BASSA"},{"$f":"+Q3","v":"MEDIA"},"ALTA","ALTA","ALTA","MEDIA","BASSA","BASSA","ALTA","BASSA","BASSA","BASSA",null,null,"ANNO","ricavi",{"$f":"+B14","v":600},{"$f":"+C14","v":2170},4860,5022,5022,2100,620,600,5022,620,560,620,{"$f":"+P14","v":600},2170,4860,5022,5022,2100,620,600,5022,620,560,620,{"$f":"+AD14","v":600},2170,4860,5022,5022,2100,620,600,5022,620,560,620,"RICAVI"]
[{"$f":"+'1) INPUT BASE'!B16","v":"CAMERE QUADRUPLE"},{"$f":"+B17*B40","v":0},0,0,0,0,0,0,0,0,0,0,0,{"$f":"SUM(B4:M4)","v":0},null,{"$f":"+P17*P40","v":0},0,0,0,0,0,0,0,0,0,0,0,{"$f":"SUM(P4:AA4)","v":0},null,{"$f":"+AD17*AD40","v":0},0,0,0,0,0,0,0,0,0,0,0,{"$f":"SUM(AD4:AO4)","v":0},null,{"$f":"+DATE('4) INPUT INPS'!C2,12,31)","v":"2016-12-31"},null,{"$f":"+IF(AT2<=$AR$4,AT3,0)","v":600},2170,4860,5022,5022,2100,620,600,5022,0,0,0,0,0,0,0,0,0,0,0,0,0,0,0,0,0,0,0,0,0,0,0,0,0,0,0,{"$f":"SUM(AT4:CC4)","v":26016}]
[{"$f":"+'1) INPUT BASE'!B17","v":"CAMERE TRIPLE"},{"$f":"+B18*B41","v":0},0,0,0,0,0,0,0,0,0,0,0,{"$f":"SUM(B5:M5)","v":0},null,{"$f":"+P18*P41","v":0},0,0,0,0,0,0,0,0,0,0,0,{"$f":"SUM(P5:AA5)","v":0},null,{"$f":"+AD18*AD41","v":0},0,0,0,0,0,0,0,0,0,0,0,{"$f":"SUM(AD5:AO5)","v":0},null,{"$f":"+DATE('4) INPUT INPS'!D2,12,31)","v":"2017-12-31"},null,{"$f":"+IF(AT2>$AR$4,IF(AT2<=$AR$5,AT3,0),0)","v":0},{"$f":"+IF(AU2>$AR$4,IF(AU2<=$AR$5,AU3,0),0)","v":0},0,0,0,0,0,0,0,620,560,620,600,2170,4860,5022,5022,2100,620,600,5022,0,0,0,0,0,0,0,0,0,0,0,0,0,0,0,{"$f":"SUM(AT5:CC5)","v":27816}]
[{"$f":"+'1) INPUT BASE'!B18","v":"CAMERE DOPPIE"},{"$f":"+B19*B42","v":600},2170,4860,5022,5022,2100,620,600,5022,620,560,620,27816,null,{"$f":"+P19*P42","v":600},2170,4860,5022,5022,2100,620,600,5022,620,560,620,27816,null,{"$f":"+AD19*AD42","v":600},2170,4860,5022,5022,2100,620,600,5022,620,560,620,27816,null,{"$f":"+DATE('4) INPUT INPS'!E2,12,31)","v":"2018-12-31"},null,{"$f":"+IF(AT2>$AR$5,IF(AT2<=$AR$6,AT3,0),0)","v":0},{"$f":"+IF(AU2>$AR$5,IF(AU2<=$AR$6,AU3,0),0)","v":0},0,0,0,0,0,0,0,0,0,0,0,0,0,0,0,0,0,0,0,620,560,620,600,2170,4860,5022,5022,2100,620,600,5022,0,0,0,27816]
[{"$f":"+'1) INPUT BASE'!B19","v":"CAMERE SINGOLE"},{"$f":"+B20*B43","v":0},0,0,0,0,0,0,0,0,0,0,0,0,null,{"$f":"+P20*P43","v":0},0,0,0,0,0,0,0,0,0,0,0,0,null,{"$f":"+AD20*AD43","v":0},0,0,0,0,0,0,0,0,0,0,0,0,null,{"$f":"+DATE('4) INPUT INPS'!F2,12,31)","v":"2019-12-31"},null,{"$f":"+IF(AT2>$AR$6,IF(AT2<=$AR$7,AT3,0),0)","v":0},{"$f":"+IF(AU2>$AR$6,IF(AU2<=$AR$7,AU3,0),0)","v":0},0,0,0,0,0,0,0,0,0,0,0,0,0,0,0,0,0,0,0,0,0,0,0,0,0,0,0,0,0,0,0,620,560,620,1800]
[{"$f":"+'1) INPUT BASE'!B20","v":"VISITE GUIDATE"},{"$f":"+B21*B44","v":0},0,0,0,0,0,0,0,0,0,0,0,0,null,{"$f":"+P21*P44","v":0},0,0,0,0,0,0,0,0,0,0,0,0,null,{"$f":"+AD21*AD44","v":0},0,0,0,0,0,0,0,0,0,0,0,0,null,"TOTALE",null,null,null,null,null,null,null,null,null,null,null,null,null,null,null,null,null,null,null,null,null,null,null,null,null,null,null,null,null,null,null,null,null,null,null,null,null,{"$f":"SUM(CD4:CD7)","v":83448}]
[{"$f":"+'1) INPUT BASE'!B21","v":"Altri ricavi"},{"$f":"+B22*B45","v":0},0,0,0,0,0,0,0,0,0,0,0,0,null,{"$f":"+P22*P45","v":0},0,0,0,0,0,0,0,0,0,0,0,0,null,{"$f":"+AD22*AD45","v":0},0,0,0,0,0,0,0,0,0,0,0,0]
[{"$f":"+'1) INPUT BASE'!B22","v":"Altri ricavi"},{"$f":"+B23*B46","v":0},0,0,0,0,0,0,0,0,0,0,0,0,null,{"$f":"+P23*P46","v":0},0,0,0,0,0,0,0,0,0,0,0,0,null,{"$f":"+AD23*AD46","v":0},0,0,0,0,0,0,0,0,0,0,0,0]
[{"$f":"+'1) INPUT BASE'!B23","v":"Altri ricavi"},{"$f":"+B24*B47","v":0},0,0,0,0,0,0,0,0,0,0,0,0,null,{"$f":"+P24*P47","v":0},0,0,0,0,0,0,0,0,0,0,0,0,null,{"$f":"+AD24*AD47","v":0},0,0,0,0,0,0,0,0,0,0,0,0]
[{"$f":"+'1) INPUT BASE'!B24","v":"Altri ricavi"},{"$f":"+B25*B48","v":0},0,0,0,0,0,0,0,0,0,0,0,0,null,{"$f":"+P25*P48","v":0},0,0,0,0,0,0,0,0,0,0,0,0,null,{"$f":"+AD25*AD48","v":0},0,0,0,0,0,0,0,0,0,0,0,0]
[{"$f":"+'1) INPUT BASE'!B25","v":"Altri ricavi"},{"$f":"+B26*B49","v":0},0,0,0,0,0,0,0,0,0,0,0,0,null,{"$f":"+P26*P49","v":0},0,0,0,0,0,0,0,0,0,0,0,0,null,{"$f":"+AD26*AD49","v":0},0,0,0,0,0,0,0,0,0,0,0,0]
["TOTALE",{"$f":"SUM(B4:B13)","v":600},{"$f":"SUM(C4:C13)","v":2170},4860,5022,5022,2100,620,600,5022,620,560,620,{"$f":"SUM(N4:N13)","v":27816},null,{"$f":"SUM(P4:P13)","v":600},{"$f":"SUM(Q4:Q13)","v":2170},4860,5022,5022,2100,620,600,5022,620,560,620,{"$f":"SUM(AB4:AB13)","v":27816},"TOTALE",{"$f":"SUM(AD4:AD13)","v":600},{"$f":"SUM(AE4:AE13)","v":2170},4860,5022,5022,2100,620,600,5022,620,560,620,{"$f":"SUM(AP4:AP13)","v":27816}]
[null,"MESI",null,null,null,null,null,null,null,null,null,null,null,"ANNO 1","RIPRISITNA","MESI",null,null,null,null,null,null,null,null,null,null,null,"ANNO 2","RIPRISTINA","MESI",null,null,null,null,null,null,null,null,null,null,null,"ANNO 3"]
["N. PRENOTAZIONI",{"$f":"+B2","v":"2016-04-30"},{"$f":"+EOMONTH(B16,1)","v":"2016-05-31"},{"$f":"+EOMONTH(C16,1)","v":"2016-06-30"},"2016-07-31","2016-08-31","2016-09-30","2016-10-31","2016-11-30","2016-12-31","2017-01-31","2017-02-28","2017-03-31","TOTALE","IPOTESI %",{"$f":"+EOMONTH(M16,1)","v":"2017-04-30"},{"$f":"+EOMONTH(P16,1)","v":"2017-05-31"},{"$f":"+EOMONTH(Q16,1)","v":"2017-06-30"},"2017-07-31","2017-08-31","2017-09-30","2017-10-31","2017-11-30","2017-12-31","2018-01-31","2018-02-28",{"$f":"+EOMONTH(Z16,1)","v":"2018-03-31"},"TOTALE","IPOTESI %",{"$f":"+EOMONTH(AA16,1)","v":"2018-04-30"},{"$f":"+EOMONTH(AD16,1)","v":"2018-05-31"},{"$f":"+EOMONTH(AE16,1)","v":"2018-06-30"},"2018-07-31","2018-08-31","2018-09-30","2018-10-31","2018-11-30","2018-12-31","2019-01-31","2019-02-28","2019-03-31","TOTALE"]
[{"$f":"+A4","v":"CAMERE QUADRUPLE"},null,null,null,null,null,null,null,null,null,null,null,null,{"$f":"SUM(B17:M17)","v":0},0,{"$f":"+(1+$O17)*B17","v":0},{"$f":"+(1+$O17)*C17","v":0},{"$f":"+(1+$O17)*D17","v":0},{"$f":"+(1+$O17)*E17","v":0},{"$f":"+(1+$O17)*F17","v":0},{"$f":"+(1+$O17)*G17","v":0},{"$f":"+(1+$O17)*H17","v":0},{"$f":"+(1+$O17)*I17","v":0},{"$f":"+(1+$O17)*J17","v":0},{"$f":"+(1+$O17)*K17","v":0},{"$f":"+(1+$O17)*L17","v":0},{"$f":"+(1+$O17)*M17","v":0},{"$f":"SUM(P17:AA17)","v":0},0,{"$f":"+(1+$AC17)*P17","v":0},{"$f":"+(1+$AC17)*Q17","v":0},{"$f":"+(1+$AC17)*R17","v":0},{"$f":"+(1+$AC17)*S17","v":0},{"$f":"+(1+$AC17)*T17","v":0},{"$f":"+(1+$AC17)*U17","v":0},{"$f":"+(1+$AC17)*V17","v":0},{"$f":"+(1+$AC17)*W17","v":0},{"$f":"+(1+$AC17)*X17","v":0},{"$f":"+(1+$AC17)*Y17","v":0},{"$f":"+(1+$AC17)*Z17","v":0},{"$f":"+(1+$AC17)*AA17","v":0},{"$f":"SUM(AD17:AO17)","v":0}]
["CAMERE TRIPLE",null,null,null,null,null,null,null,null,null,null,null,null,0,0,0,0,0,0,0,0,0,0,0,0,0,0,{"$f":"SUM(P18:AA18)","v":0},0,0,0,0,0,0,0,0,0,0,0,0,0,{"$f":"SUM(AD18:AO18)","v":0}]
["CAMERE DOPPIE",{"$f":"+IF(B3=\"BASSA\",B28*0.2,IF(B3=\"MEDIA\",B28*0.5,IF(B3=\"ALTA\",B28*0.9)))","v":12},{"$f":"+IF(C3=\"BASSA\",C28*0.2,IF(C3=\"MEDIA\",C28*0.5,IF(C3=\"ALTA\",C28*0.9)))","v":31},54,55.800000000000004,55.800000000000004,30,12.4,12,55.800000000000004,12.4,11.200000000000001,12.4,354.79999999999995,0,12,31,54,55.800000000000004,55.800000000000004,30,12.4,12,55.800000000000004,12.4,11.200000000000001,12.4,354.79999999999995,0,12,31,54,55.800000000000004,55.800000000000004,30,12.4,12,55.800000000000004,12.4,11.200000000000001,12.4,354.79999999999995]
["CAMERE SINGOLE",null,null,null,null,null,null,null,null,null,null,null,null,0,0,0,0,0,0,0,0,0,0,0,0,0,0,0,0,0,0,0,0,0,0,0,0,0,0,0,0,0]
["VISITE GUIDATE",null,null,null,null,null,null,null,null,null,null,null,null,0,0,0,0,0,0,0,0,0,0,0,0,0,0,0,0,0,0,0,0,0,0,0,0,0,0,0,0,0]
["Altri ricavi",null,null,null,null,null,null,null,null,null,null,null,null,0,0,0,0,0,0,0,0,0,0,0,0,0,0,0,0,0,0,0,0,0,0,0,0,0,0,0,0,0]
["Altri ricavi",null,null,null,null,null,null,null,null,null,null,null,null,0,0,0,0,0,0,0,0,0,0,0,0,0,0,0,0,0,0,0,0,0,0,0,0,0,0,0,0,0]
["Altri ricavi",null,null,null,null,null,null,null,null,null,null,null,null,0,0,0,0,0,0,0,0,0,0,0,0,0,0,0,0,0,0,0,0,0,0,0,0,0,0,0,0,0]
["Altri ricavi",null,null,null,null,null,null,null,null,null,null,null,null,0,0,0,0,0,0,0,0,0,0,0,0,0,0,0,0,0,0,0,0,0,0,0,0,0,0,0,0,0]
["Altri ricavi",null,null,null,null,null,null,null,null,null,null,null,null,0,0,{"$f":"+(1+$O26)*B26","v":0},{"$f":"+(1+$O26)*C26","v":0},{"$f":"+(1+$O26)*D26","v":0},{"$f":"+(1+$O26)*E26","v":0},{"$f":"+(1+$O26)*F26","v":0},{"$f":"+(1+$O26)*G26","v":0},{"$f":"+(1+$O26)*H26","v":0},{"$f":"+(1+$O26)*I26","v":0},{"$f":"+(1+$O26)*J26","v":0},{"$f":"+(1+$O26)*K26","v":0},{"$f":"+(1+$O26)*L26","v":0},{"$f":"+(1+$O26)*M26","v":0},0,0,{"$f":"+(1+$AC26)*P26","v":0},{"$f":"+(1+$AC26)*Q26","v":0},{"$f":"+(1+$AC26)*R26","v":0},{"$f":"+(1+$AC26)*S26","v":0},{"$f":"+(1+$AC26)*T26","v":0},{"$f":"+(1+$AC26)*U26","v":0},{"$f":"+(1+$AC26)*V26","v":0},{"$f":"+(1+$AC26)*W26","v":0},{"$f":"+(1+$AC26)*X26","v":0},{"$f":"+(1+$AC26)*Y26","v":0},{"$f":"+(1+$AC26)*Z26","v":0},{"$f":"+(1+$AC26)*AA26","v":0},0]
["GG. MESE",{"$f":"+_xlfn.DAYS(B16,EOMONTH(B16-32,0))","v":30},{"$f":"+_xlfn.DAYS(C16,B16)","v":31},{"$f":"+_xlfn.DAYS(D16,C16)","v":30},31,31,30,31,30,{"$f":"+_xlfn.DAYS(J16,I16)","v":31},31,28,{"$f":"+_xlfn.DAYS(M16,L16)","v":31},{"$f":"SUM(N17:N26)","v":354.79999999999995},"GG. MESE",{"$f":"+_xlfn.DAYS(P16,M16)","v":30},{"$f":"+_xlfn.DAYS(Q16,P16)","v":31},30,31,31,30,31,30,31,31,28,31,{"$f":"SUM(AB17:AB26)","v":354.79999999999995},"GG. MESE",{"$f":"+_xlfn.DAYS(AD16,AA16)","v":30},{"$f":"+_xlfn.DAYS(AE16,AD16)","v":31},30,31,31,30,31,30,31,31,28,31,{"$f":"SUM(AP17:AP26)","v":354.79999999999995}]
["Numero massimo notti prenotabili TOT",{"$f":"('1) INPUT BASE'!$C$16+'1) INPUT BASE'!$C$17+'1) INPUT BASE'!$C$18+'1) INPUT BASE'!$C$19)*B27","v":60},{"$f":"('1) INPUT BASE'!$C$16+'1) INPUT BASE'!$C$17+'1) INPUT BASE'!$C$18+'1) INPUT BASE'!$C$19)*C27","v":62},{"$f":"('1) INPUT BASE'!$C$16+'1) INPUT BASE'!$C$17+'1) INPUT BASE'!$C$18+'1) INPUT BASE'!$C$19)*D27","v":60},{"$f":"('1) INPUT BASE'!$C$16+'1) INPUT BASE'!$C$17+'1) INPUT BASE'!$C$18+'1) INPUT BASE'!$C$19)*E27","v":62},{"$f":"('1) INPUT BASE'!$C$16+'1) INPUT BASE'!$C$17+'1) INPUT BASE'!$C$18+'1) INPUT BASE'!$C$19)*F27","v":62},{"$f":"('1) INPUT BASE'!$C$16+'1) INPUT BASE'!$C$17+'1) INPUT BASE'!$C$18+'1) INPUT BASE'!$C$19)*G27","v":60},{"$f":"('1) INPUT BASE'!$C$16+'1) INPUT BASE'!$C$17+'1) INPUT BASE'!$C$18+'1) INPUT BASE'!$C$19)*H27","v":62},{"$f":"('1) INPUT BASE'!$C$16+'1) INPUT BASE'!$C$17+'1) INPUT BASE'!$C$18+'1) INPUT BASE'!$C$19)*I27","v":60},{"$f":"('1) INPUT BASE'!$C$16+'1) INPUT BASE'!$C$17+'1) INPUT BASE'!$C$18+'1) INPUT BASE'!$C$19)*J27","v":62},{"$f":"('1) INPUT BASE'!$C$16+'1) INPUT BASE'!$C$17+'1) INPUT BASE'!$C$18+'1) INPUT BASE'!$C$19)*K27","v":62},{"$f":"('1) INPUT BASE'!$C$16+'1) INPUT BASE'!$C$17+'1) INPUT BASE'!$C$18+'1) INPUT BASE'!$C$19)*L27","v":56},{"$f":"('1) INPUT BASE'!$C$16+'1) INPUT BASE'!$C$17+'1) INPUT BASE'!$C$18+'1) INPUT BASE'!$C$19)*M27","v":62},null,null,{"$f":"('1) INPUT BASE'!$C$16+'1) INPUT BASE'!$C$17+'1) INPUT BASE'!$C$18+'1) INPUT BASE'!$C$19)*P27","v":60},{"$f":"('1) INPUT BASE'!$C$16+'1) INPUT BASE'!$C$17+'1) INPUT BASE'!$C$18+'1) INPUT BASE'!$C$19)*Q27","v":62},{"$f":"('1) INPUT BASE'!$C$16+'1) INPUT BASE'!$C$17+'1) INPUT BASE'!$C$18+'1) INPUT BASE'!$C$19)*R27","v":60},{"$f":"('1) INPUT BASE'!$C$16+'1) INPUT BASE'!$C$17+'1) INPUT BASE'!$C$18+'1) INPUT BASE'!$C$19)*S27","v":62},{"$f":"('1) INPUT BASE'!$C$16+'1) INPUT BASE'!$C$17+'1) INPUT BASE'!$C$18+'1) INPUT BASE'!$C$19)*T27","v":62},{"$f":"('1) INPUT BASE'!$C$16+'1) INPUT BASE'!$C$17+'1) INPUT BASE'!$C$18+'1) INPUT BASE'!$C$19)*U27","v":60},{"$f":"('1) INPUT BASE'!$C$16+'1) INPUT BASE'!$C$17+'1) INPUT BASE'!$C$18+'1) INPUT BASE'!$C$19)*V27","v":62},{"$f":"('1) INPUT BASE'!$C$16+'1) INPUT BASE'!$C$17+'1) INPUT BASE'!$C$18+'1) INPUT BASE'!$C$19)*W27","v":60},{"$f":"('1) INPUT BASE'!$C$16+'1) INPUT BASE'!$C$17+'1) INPUT BASE'!$C$18+'1) INPUT BASE'!$C$19)*X27","v":62},{"$f":"('1) INPUT BASE'!$C$16+'1) INPUT BASE'!$C$17+'1) INPUT BASE'!$C$18+'1) INPUT BASE'!$C$19)*Y27","v":62},{"$f":"('1) INPUT BASE'!$C$16+'1) INPUT BASE'!$C$17+'1) INPUT BASE'!$C$18+'1) INPUT BASE'!$C$19)*Z27","v":56},{"$f":"('1) INPUT BASE'!$C$16+'1) INPUT BASE'!$C$17+'1) INPUT BASE'!$C$18+'1) INPUT BASE'!$C$19)*AA27","v":62},null,null,{"$f":"('1) INPUT BASE'!$C$16+'1) INPUT BASE'!$C$17+'1) INPUT BASE'!$C$18+'1) INPUT BASE'!$C$19)*AD27","v":60},{"$f":"('1) INPUT BASE'!$C$16+'1) INPUT BASE'!$C$17+'1) INPUT BASE'!$C$18+'1) INPUT BASE'!$C$19)*AE27","v":62},{"$f":"('1) INPUT BASE'!$C$16+'1) INPUT BASE'!$C$17+'1) INPUT BASE'!$C$18+'1) INPUT BASE'!$C$19)*AF27","v":60},{"$f":"('1) INPUT BASE'!$C$16+'1) INPUT BASE'!$C$17+'1) INPUT BASE'!$C$18+'1) INPUT BASE'!$C$19)*AG27","v":62},{"$f":"('1) INPUT BASE'!$C$16+'1) INPUT BASE'!$C$17+'1) INPUT BASE'!$C$18+'1) INPUT BASE'!$C$19)*AH27","v":62},{"$f":"('1) INPUT BASE'!$C$16+'1) INPUT BASE'!$C$17+'1) INPUT BASE'!$C$18+'1) INPUT BASE'!$C$19)*AI27","v":60},{"$f":"('1) INPUT BASE'!$C$16+'1) INPUT BASE'!$C$17+'1) INPUT BASE'!$C$18+'1) INPUT BASE'!$C$19)*AJ27","v":62},{"$f":"('1) INPUT BASE'!$C$16+'1) INPUT BASE'!$C$17+'1) INPUT BASE'!$C$18+'1) INPUT BASE'!$C$19)*AK27","v":60},{"$f":"('1) INPUT BASE'!$C$16+'1) INPUT BASE'!$C$17+'1) INPUT BASE'!$C$18+'1) INPUT BASE'!$C$19)*AL27","v":62},{"$f":"('1) INPUT BASE'!$C$16+'1) INPUT BASE'!$C$17+'1) INPUT BASE'!$C$18+'1) INPUT BASE'!$C$19)*AM27","v":62},{"$f":"('1) INPUT BASE'!$C$16+'1) INPUT BASE'!$C$17+'1) INPUT BASE'!$C$18+'1) INPUT BASE'!$C$19)*AN27","v":56},{"$f":"('1) INPUT BASE'!$C$16+'1) INPUT BASE'!$C$17+'1) INPUT BASE'!$C$18+'1) INPUT BASE'!$C$19)*AO27","v":62}]
["Numero massimo notti prenot. CAM. QUAD",{"$f":"+'1) INPUT BASE'!$C$16*'3) INPUT VENDITE'!B27","v":0},{"$f":"+'1) INPUT BASE'!$C$16*'3) INPUT VENDITE'!C27","v":0},{"$f":"+'1) INPUT BASE'!$C$16*'3) INPUT VENDITE'!D27","v":0},{"$f":"+'1) INPUT BASE'!$C$16*'3) INPUT VENDITE'!E27","v":0},{"$f":"+'1) INPUT BASE'!$C$16*'3) INPUT VENDITE'!F27","v":0},{"$f":"+'1) INPUT BASE'!$C$16*'3) INPUT VENDITE'!G27","v":0},{"$f":"+'1) INPUT BASE'!$C$16*'3) INPUT VENDITE'!H27","v":0},{"$f":"+'1) INPUT BASE'!$C$16*'3) INPUT VENDITE'!I27","v":0},{"$f":"+'1) INPUT BASE'!$C$16*'3) INPUT VENDITE'!J27","v":0},{"$f":"+'1) INPUT BASE'!$C$16*'3) INPUT VENDITE'!K27","v":0},{"$f":"+'1) INPUT BASE'!$C$16*'3) INPUT VENDITE'!L27","v":0},{"$f":"+'1) INPUT BASE'!$C$16*'3) INPUT VENDITE'!M27","v":0},null,null,{"$f":"+'1) INPUT BASE'!$C$16*'3) INPUT VENDITE'!P27","v":0},{"$f":"+'1) INPUT BASE'!$C$16*'3) INPUT VENDITE'!Q27","v":0},{"$f":"+'1) INPUT BASE'!$C$16*'3) INPUT VENDITE'!R27","v":0},{"$f":"+'1) INPUT BASE'!$C$16*'3) INPUT VENDITE'!S27","v":0},{"$f":"+'1) INPUT BASE'!$C$16*'3) INPUT VENDITE'!T27","v":0},{"$f":"+'1) INPUT BASE'!$C$16*'3) INPUT VENDITE'!U27","v":0},{"$f":"+'1) INPUT BASE'!$C$16*'3) INPUT VENDITE'!V27","v":0},{"$f":"+'1) INPUT BASE'!$C$16*'3) INPUT VENDITE'!W27","v":0},{"$f":"+'1) INPUT BASE'!$C$16*'3) INPUT VENDITE'!X27","v":0},{"$f":"+'1) INPUT BASE'!$C$16*'3) INPUT VENDITE'!Y27","v":0},{"$f":"+'1) INPUT BASE'!$C$16*'3) INPUT VENDITE'!Z27","v":0},{"$f":"+'1) INPUT BASE'!$C$16*'3) INPUT VENDITE'!AA27","v":0},null,null,{"$f":"+'1) INPUT BASE'!$C$16*'3) INPUT VENDITE'!AD27","v":0},{"$f":"+'1) INPUT BASE'!$C$16*'3) INPUT VENDITE'!AE27","v":0},{"$f":"+'1) INPUT BASE'!$C$16*'3) INPUT VENDITE'!AF27","v":0},{"$f":"+'1) INPUT BASE'!$C$16*'3) INPUT VENDITE'!AG27","v":0},{"$f":"+'1) INPUT BASE'!$C$16*'3) INPUT VENDITE'!AH27","v":0},{"$f":"+'1) INPUT BASE'!$C$16*'3) INPUT VENDITE'!AI27","v":0},{"$f":"+'1) INPUT BASE'!$C$16*'3) INPUT VENDITE'!AJ27","v":0},{"$f":"+'1) INPUT BASE'!$C$16*'3) INPUT VENDITE'!AK27","v":0},{"$f":"+'1) INPUT BASE'!$C$16*'3) INPUT VENDITE'!AL27","v":0},{"$f":"+'1) INPUT BASE'!$C$16*'3) INPUT VENDITE'!AM27","v":0},{"$f":"+'1) INPUT BASE'!$C$16*'3) INPUT VENDITE'!AN27","v":0},{"$f":"+'1) INPUT BASE'!$C$16*'3) INPUT VENDITE'!AO27","v":0}]
["Numero massimo notti prenot. CAM. TRIP.",{"$f":"B28*'1) INPUT BASE'!$C$17","v":0},{"$f":"C28*'1) INPUT BASE'!$C$17","v":0},{"$f":"D28*'1) INPUT BASE'!$C$17","v":0},{"$f":"E28*'1) INPUT BASE'!$C$17","v":0},{"$f":"F28*'1) INPUT BASE'!$C$17","v":0},{"$f":"G28*'1) INPUT BASE'!$C$17","v":0},{"$f":"H28*'1) INPUT BASE'!$C$17","v":0},{"$f":"I28*'1) INPUT BASE'!$C$17","v":0},{"$f":"J28*'1) INPUT BASE'!$C$17","v":0},{"$f":"K28*'1) INPUT BASE'!$C$17","v":0},{"$f":"L28*'1) INPUT BASE'!$C$17","v":0},{"$f":"M28*'1) INPUT BASE'!$C$17","v":0},null,null,{"$f":"P28*'1) INPUT BASE'!$C$17","v":0},{"$f":"Q28*'1) INPUT BASE'!$C$17","v":0},{"$f":"R28*'1) INPUT BASE'!$C$17","v":0},{"$f":"S28*'1) INPUT BASE'!$C$17","v":0},{"$f":"T28*'1) INPUT BASE'!$C$17","v":0},{"$f":"U28*'1) INPUT BASE'!$C$17","v":0},{"$f":"V28*'1) INPUT BASE'!$C$17","v":0},{"$f":"W28*'1) INPUT BASE'!$C$17","v":0},{"$f":"X28*'1) INPUT BASE'!$C$17","v":0},{"$f":"Y28*'1) INPUT BASE'!$C$17","v":0},{"$f":"Z28*'1) INPUT BASE'!$C$17","v":0},{"$f":"AA28*'1) INPUT BASE'!$C$17","v":0},null,null,{"$f":"AD28*'1) INPUT BASE'!$C$17","v":0},{"$f":"AE28*'1) INPUT BASE'!$C$17","v":0},{"$f":"AF28*'1) INPUT BASE'!$C$17","v":0},{"$f":"AG28*'1) INPUT BASE'!$C$17","v":0},{"$f":"AH28*'1) INPUT BASE'!$C$17","v":0},{"$f":"AI28*'1) INPUT BASE'!$C$17","v":0},{"$f":"AJ28*'1) INPUT BASE'!$C$17","v":0},{"$f":"AK28*'1) INPUT BASE'!$C$17","v":0},{"$f":"AL28*'1) INPUT BASE'!$C$17","v":0},{"$f":"AM28*'1) INPUT BASE'!$C$17","v":0},{"$f":"AN28*'1) INPUT BASE'!$C$17","v":0},{"$f":"AO28*'1) INPUT BASE'!$C$17","v":0}]
["Numero massimo notti prenot. CAM. DOP.",{"$f":"+B27*'1) INPUT BASE'!$C$18","v":60},{"$f":"+C27*'1) INPUT BASE'!$C$18","v":62},{"$f":"+D27*'1) INPUT BASE'!$C$18","v":60},{"$f":"+E27*'1) INPUT BASE'!$C$18","v":62},{"$f":"+F27*'1) INPUT BASE'!$C$18","v":62},{"$f":"+G27*'1) INPUT BASE'!$C$18","v":60},{"$f":"+H27*'1) INPUT BASE'!$C$18","v":62},{"$f":"+I27*'1) INPUT BASE'!$C$18","v":60},{"$f":"+J27*'1) INPUT BASE'!$C$18","v":62},{"$f":"+K27*'1) INPUT BASE'!$C$18","v":62},{"$f":"+L27*'1) INPUT BASE'!$C$18","v":56},{"$f":"+M27*'1) INPUT BASE'!$C$18","v":62},null,null,{"$f":"+P27*'1) INPUT BASE'!$C$18","v":60},{"$f":"+Q27*'1) INPUT BASE'!$C$18","v":62},{"$f":"+R27*'1) INPUT BASE'!$C$18","v":60},{"$f":"+S27*'1) INPUT BASE'!$C$18","v":62},{"$f":"+T27*'1) INPUT BASE'!$C$18","v":62},{"$f":"+U27*'1) INPUT BASE'!$C$18","v":60},{"$f":"+V27*'1) INPUT BASE'!$C$18","v":62},{"$f":"+W27*'1) INPUT BASE'!$C$18","v":60},{"$f":"+X27*'1) INPUT BASE'!$C$18","v":62},{"$f":"+Y27*'1) INPUT BASE'!$C$18","v":62},{"$f":"+Z27*'1) INPUT BASE'!$C$18","v":56},{"$f":"+AA27*'1) INPUT BASE'!$C$18","v":62},null,null,{"$f":"+AD27*'1) INPUT BASE'!$C$18","v":60},{"$f":"+AE27*'1) INPUT BASE'!$C$18","v":62},{"$f":"+AF27*'1) INPUT BASE'!$C$18","v":60},{"$f":"+AG27*'1) INPUT BASE'!$C$18","v":62},{"$f":"+AH27*'1) INPUT BASE'!$C$18","v":62},{"$f":"+AI27*'1) INPUT BASE'!$C$18","v":60},{"$f":"+AJ27*'1) INPUT BASE'!$C$18","v":62},{"$f":"+AK27*'1) INPUT BASE'!$C$18","v":60},{"$f":"+AL27*'1) INPUT BASE'!$C$18","v":62},{"$f":"+AM27*'1) INPUT BASE'!$C$18","v":62},{"$f":"+AN27*'1) INPUT BASE'!$C$18","v":56},{"$f":"+AO27*'1) INPUT BASE'!$C$18","v":62}]
["Numero massimo notti prenot. CAM. SING.",{"$f":"+B27*'1) INPUT BASE'!$C$19","v":0},{"$f":"+C27*'1) INPUT BASE'!$C$19","v":0},{"$f":"+D27*'1) INPUT BASE'!$C$19","v":0},{"$f":"+E27*'1) INPUT BASE'!$C$19","v":0},{"$f":"+F27*'1) INPUT BASE'!$C$19","v":0},{"$f":"+G27*'1) INPUT BASE'!$C$19","v":0},{"$f":"+H27*'1) INPUT BASE'!$C$19","v":0},{"$f":"+I27*'1) INPUT BASE'!$C$19","v":0},{"$f":"+J27*'1) INPUT BASE'!$C$19","v":0},{"$f":"+K27*'1) INPUT BASE'!$C$19","v":0},{"$f":"+L27*'1) INPUT BASE'!$C$19","v":0},{"$f":"+M27*'1) INPUT BASE'!$C$19","v":0},null,null,{"$f":"+P27*'1) INPUT BASE'!$C$19","v":0},{"$f":"+Q27*'1) INPUT BASE'!$C$19","v":0},{"$f":"+R27*'1) INPUT BASE'!$C$19","v":0},{"$f":"+S27*'1) INPUT BASE'!$C$19","v":0},{"$f":"+T27*'1) INPUT BASE'!$C$19","v":0},{"$f":"+U27*'1) INPUT BASE'!$C$19","v":0},{"$f":"+V27*'1) INPUT BASE'!$C$19","v":0},{"$f":"+W27*'1) INPUT BASE'!$C$19","v":0},{"$f":"+X27*'1) INPUT BASE'!$C$19","v":0},{"$f":"+Y27*'1) INPUT BASE'!$C$19","v":0},{"$f":"+Z27*'1) INPUT BASE'!$C$19","v":0},{"$f":"+AA27*'1) INPUT BASE'!$C$19","v":0},null,null,{"$f":"+AD27*'1) INPUT BASE'!$C$19","v":0},{"$f":"+AE27*'1) INPUT BASE'!$C$19","v":0},{"$f":"+AF27*'1) INPUT BASE'!$C$19","v":0},{"$f":"+AG27*'1) INPUT BASE'!$C$19","v":0},{"$f":"+AH27*'1) INPUT BASE'!$C$19","v":0},{"$f":"+AI27*'1) INPUT BASE'!$C$19","v":0},{"$f":"+AJ27*'1) INPUT BASE'!$C$19","v":0},{"$f":"+AK27*'1) INPUT BASE'!$C$19","v":0},{"$f":"+AL27*'1) INPUT BASE'!$C$19","v":0},{"$f":"+AM27*'1) INPUT BASE'!$C$19","v":0},{"$f":"+AN27*'1) INPUT BASE'!$C$19","v":0},{"$f":"+AO27*'1) INPUT BASE'!$C$19","v":0}]
["% prenotazioni totali",{"$f":"IFERROR(SUM(B17:B20)/B28,0)","v":0.2},{"$f":"IFERROR(SUM(C17:C20)/C28,0)","v":0.5},{"$f":"IFERROR(SUM(D17:D20)/D28,0)","v":0.9},0.9,0.9,0.5,0.2,0.2,0.9,{"$f":"IFERROR(SUM(K17:K20)/K28,0)","v":0.2},0.2,0.2,null,null,{"$f":"IFERROR(SUM(P17:P20)/P28,0)","v":0.2},{"$f":"IFERROR(SUM(Q17:Q20)/Q28,0)","v":0.5},0.9,0.9,0.9,0.5,0.2,0.2,0.9,{"$f":"IFERROR(SUM(Y17:Y20)/Y28,0)","v":0.2},0.2,0.2,null,null,{"$f":"IFERROR(SUM(AD17:AD20)/AD28,0)","v":0.2},{"$f":"IFERROR(SUM(AE17:AE20)/AE28,0)","v":0.5},0.9,0.9,0.9,0.5,0.2,0.2,0.9,{"$f":"IFERROR(SUM(AM17:AM20)/AM28,0)","v":0.2},0.2,0.2]
["% prenotazioni quadruple",{"$f":"IFERROR(B17/B29,0)","v":0},{"$f":"IFERROR(C17/C29,0)","v":0},0,0,0,0,0,0,0,0,0,0,null,null,{"$f":"IFERROR(P17/P29,0)","v":0},{"$f":"IFERROR(Q17/Q29,0)","v":0},0,0,0,0,0,0,0,0,0,0,null,null,{"$f":"IFERROR(AD17/AD29,0)","v":0},{"$f":"IFERROR(AE17/AE29,0)","v":0},0,0,0,0,0,0,0,0,0,0]
["% prenotazioni triple",{"$f":"IFERROR(B18/B30,0)","v":0},{"$f":"IFERROR(C18/C30,0)","v":0},0,0,0,0,0,0,0,0,0,0,null,null,{"$f":"IFERROR(P18/P30,0)","v":0},{"$f":"IFERROR(Q18/Q30,0)","v":0},0,0,0,0,0,0,0,0,0,0,null,null,{"$f":"IFERROR(AD18/AD30,0)","v":0},{"$f":"IFERROR(AE18/AE30,0)","v":0},0,0,0,0,0,0,0,0,0,0]
["% prenotazioni doppie",{"$f":"IFERROR(B19/B31,0)","v":0.2},{"$f":"IFERROR(C19/C31,0)","v":0.5},0.9,0.9,0.9,0.5,0.2,0.2,0.9,0.2,0.2,0.2,null,null,{"$f":"IFERROR(P19/P31,0)","v":0.2},{"$f":"IFERROR(Q19/Q31,0)","v":0.5},0.9,0.9,0.9,0.5,0.2,0.2,0.9,0.2,0.2,0.2,null,null,{"$f":"IFERROR(AD19/AD31,0)","v":0.2},{"$f":"IFERROR(AE19/AE31,0)","v":0.5},0.9,0.9,0.9,0.5,0.2,0.2,0.9,0.2,0.2,0.2]
["% prenotazioni singole",{"$f":"IFERROR(B20/B32,0)","v":0},{"$f":"IFERROR(C20/C32,0)","v":0},0,0,0,0,0,0,0,0,0,0,null,null,{"$f":"IFERROR(P20/P32,0)","v":0},{"$f":"IFERROR(Q20/Q32,0)","v":0},0,0,0,0,0,0,0,0,0,0,null,null,{"$f":"IFERROR(AD20/AD32,0)","v":0},{"$f":"IFERROR(AE20/AE32,0)","v":0},0,0,0,0,0,0,0,0,0,0]
[null,"MESI",null,null,null,null,null,null,null,null,null,null,null,"ANNO 1",{"$f":"+O15","v":"RIPRISITNA"},"MESI",null,null,null,null,null,null,null,null,null,null,null,"ANNO 2","RIPRISTINA","MESI",null,null,null,null,null,null,null,null,null,null,null,"ANNO 3"]
["PREZZI UNITARIO SERVIZIO",{"$f":"+B16","v":"2016-04-30"},{"$f":"+EOMONTH(B39,1)","v":"2016-05-31"},{"$f":"+EOMONTH(C39,1)","v":"2016-06-30"},"2016-07-31","2016-08-31","2016-09-30","2016-10-31","2016-11-30","2016-12-31","2017-01-31","2017-02-28","2017-03-31",null,"IPOTESI %",{"$f":"+EOMONTH(M39,1)","v":"2017-04-30"},{"$f":"+EOMONTH(P39,1)","v":"2017-05-31"},{"$f":"+EOMONTH(Q39,1)","v":"2017-06-30"},"2017-07-31","2017-08-31","2017-09-30","2017-10-31","2017-11-30","2017-12-31","2018-01-31","2018-02-28",{"$f":"+EOMONTH(Z39,1)","v":"2018-03-31"},null,"IPOTESI %",{"$f":"+EOMONTH(AA39,1)","v":"2018-04-30"},{"$f":"+EOMONTH(AD39,1)","v":"2018-05-31"},{"$f":"+EOMONTH(AE39,1)","v":"2018-06-30"},"2018-07-31","2018-08-31","2018-09-30","2018-10-31","2018-11-30","2018-12-31","2019-01-31","2019-02-28","2019-03-31"]
[{"$f":"+A17","v":"CAMERE QUADRUPLE"},{"$f":"+IF(B$3=\"ALTA\",'1) INPUT BASE'!$D$16,IF(B$3=\"MEDIA\",'1) INPUT BASE'!$E$16,IF(B$3=\"BASSA\",'1) INPUT BASE'!$F$16,\"ERRORE\")))","v":0},{"$f":"+IF(C$3=\"ALTA\",'1) INPUT BASE'!$D$16,IF(C$3=\"MEDIA\",'1) INPUT BASE'!$E$16,IF(C$3=\"BASSA\",'1) INPUT BASE'!$F$16,\"ERRORE\")))","v":0},{"$f":"+IF(D$3=\"ALTA\",'1) INPUT BASE'!$D$16,IF(D$3=\"MEDIA\",'1) INPUT BASE'!$E$16,IF(D$3=\"BASSA\",'1) INPUT BASE'!$F$16,\"ERRORE\")))","v":0},{"$f":"+IF(E$3=\"ALTA\",'1) INPUT BASE'!$D$16,IF(E$3=\"MEDIA\",'1) INPUT BASE'!$E$16,IF(E$3=\"BASSA\",'1) INPUT BASE'!$F$16,\"ERRORE\")))","v":0},{"$f":"+IF(F$3=\"ALTA\",'1) INPUT BASE'!$D$16,IF(F$3=\"MEDIA\",'1) INPUT BASE'!$E$16,IF(F$3=\"BASSA\",'1) INPUT BASE'!$F$16,\"ERRORE\")))","v":0},{"$f":"+IF(G$3=\"ALTA\",'1) INPUT BASE'!$D$16,IF(G$3=\"MEDIA\",'1) INPUT BASE'!$E$16,IF(G$3=\"BASSA\",'1) INPUT BASE'!$F$16,\"ERRORE\")))","v":0},{"$f":"+IF(H$3=\"ALTA\",'1) INPUT BASE'!$D$16,IF(H$3=\"MEDIA\",'1) INPUT BASE'!$E$16,IF(H$3=\"BASSA\",'1) INPUT BASE'!$F$16,\"ERRORE\")))","v":0},{"$f":"+IF(I$3=\"ALTA\",'1) INPUT BASE'!$D$16,IF(I$3=\"MEDIA\",'1) INPUT BASE'!$E$16,IF(I$3=\"BASSA\",'1) INPUT BASE'!$F$16,\"ERRORE\")))","v":0},{"$f":"+IF(J$3=\"ALTA\",'1) INPUT BASE'!$D$16,IF(J$3=\"MEDIA\",'1) INPUT BASE'!$E$16,IF(J$3=\"BASSA\",'1) INPUT BASE'!$F$16,\"ERRORE\")))","v":0},{"$f":"+IF(K$3=\"ALTA\",'1) INPUT BASE'!$D$16,IF(K$3=\"MEDIA\",'1) INPUT BASE'!$E$16,IF(K$3=\"BASSA\",'1) INPUT BASE'!$F$16,\"ERRORE\")))","v":0},{"$f":"+IF(L$3=\"ALTA\",'1) INPUT BASE'!$D$16,IF(L$3=\"MEDIA\",'1) INPUT BASE'!$E$16,IF(L$3=\"BASSA\",'1) INPUT BASE'!$F$16,\"ERRORE\")))","v":0},{"$f":"+IF(M$3=\"ALTA\",'1) INPUT BASE'!$D$16,IF(M$3=\"MEDIA\",'1) INPUT BASE'!$E$16,IF(M$3=\"BASSA\",'1) INPUT BASE'!$F$16,\"ERRORE\")))","v":0},null,0,{"$f":"+(1+$O40)*B40","v":0},{"$f":"+(1+$O40)*C40","v":0},{"$f":"+(1+$O40)*D40","v":0},{"$f":"+(1+$O40)*E40","v":0},{"$f":"+(1+$O40)*F40","v":0},{"$f":"+(1+$O40)*G40","v":0},{"$f":"+(1+$O40)*H40","v":0},{"$f":"+(1+$O40)*I40","v":0},{"$f":"+(1+$O40)*J40","v":0},{"$f":"+(1+$O40)*K40","v":0},{"$f":"+(1+$O40)*L40","v":0},{"$f":"+(1+$O40)*M40","v":0},null,0,{"$f":"+(1+$AC40)*P40","v":0},{"$f":"+(1+$AC40)*Q40","v":0},{"$f":"+(1+$AC40)*R40","v":0},{"$f":"+(1+$AC40)*S40","v":0},{"$f":"+(1+$AC40)*T40","v":0},{"$f":"+(1+$AC40)*U40","v":0},{"$f":"+(1+$AC40)*V40","v":0},{"$f":"+(1+$AC40)*W40","v":0},{"$f":"+(1+$AC40)*X40","v":0},{"$f":"+(1+$AC40)*Y40","v":0},{"$f":"+(1+$AC40)*Z40","v":0},{"$f":"+(1+$AC40)*AA40","v":0}]
["CAMERE TRIPLE",{"$f":"+IF(B$3=\"ALTA\",'1) INPUT BASE'!$D$17,IF(B$3=\"MEDIA\",'1) INPUT BASE'!$E$17,IF(B$3=\"BASSA\",'1) INPUT BASE'!$F$17,\"ERRORE\")))","v":0},{"$f":"+IF(C$3=\"ALTA\",'1) INPUT BASE'!$D$17,IF(C$3=\"MEDIA\",'1) INPUT BASE'!$E$17,IF(C$3=\"BASSA\",'1) INPUT BASE'!$F$17,\"ERRORE\")))","v":0},{"$f":"+IF(D$3=\"ALTA\",'1) INPUT BASE'!$D$17,IF(D$3=\"MEDIA\",'1) INPUT BASE'!$E$17,IF(D$3=\"BASSA\",'1) INPUT BASE'!$F$17,\"ERRORE\")))","v":0},{"$f":"+IF(E$3=\"ALTA\",'1) INPUT BASE'!$D$17,IF(E$3=\"MEDIA\",'1) INPUT BASE'!$E$17,IF(E$3=\"BASSA\",'1) INPUT BASE'!$F$17,\"ERRORE\")))","v":0},{"$f":"+IF(F$3=\"ALTA\",'1) INPUT BASE'!$D$17,IF(F$3=\"MEDIA\",'1) INPUT BASE'!$E$17,IF(F$3=\"BASSA\",'1) INPUT BASE'!$F$17,\"ERRORE\")))","v":0},{"$f":"+IF(G$3=\"ALTA\",'1) INPUT BASE'!$D$17,IF(G$3=\"MEDIA\",'1) INPUT BASE'!$E$17,IF(G$3=\"BASSA\",'1) INPUT BASE'!$F$17,\"ERRORE\")))","v":0},{"$f":"+IF(H$3=\"ALTA\",'1) INPUT BASE'!$D$17,IF(H$3=\"MEDIA\",'1) INPUT BASE'!$E$17,IF(H$3=\"BASSA\",'1) INPUT BASE'!$F$17,\"ERRORE\")))","v":0},{"$f":"+IF(I$3=\"ALTA\",'1) INPUT BASE'!$D$17,IF(I$3=\"MEDIA\",'1) INPUT BASE'!$E$17,IF(I$3=\"BASSA\",'1) INPUT BASE'!$F$17,\"ERRORE\")))","v":0},{"$f":"+IF(J$3=\"ALTA\",'1) INPUT BASE'!$D$17,IF(J$3=\"MEDIA\",'1) INPUT BASE'!$E$17,IF(J$3=\"BASSA\",'1) INPUT BASE'!$F$17,\"ERRORE\")))","v":0},{"$f":"+IF(K$3=\"ALTA\",'1) INPUT BASE'!$D$17,IF(K$3=\"MEDIA\",'1) INPUT BASE'!$E$17,IF(K$3=\"BASSA\",'1) INPUT BASE'!$F$17,\"ERRORE\")))","v":0},{"$f":"+IF(L$3=\"ALTA\",'1) INPUT BASE'!$D$17,IF(L$3=\"MEDIA\",'1) INPUT BASE'!$E$17,IF(L$3=\"BASSA\",'1) INPUT BASE'!$F$17,\"ERRORE\")))","v":0},{"$f":"+IF(M$3=\"ALTA\",'1) INPUT BASE'!$D$17,IF(M$3=\"MEDIA\",'1) INPUT BASE'!$E$17,IF(M$3=\"BASSA\",'1) INPUT BASE'!$F$17,\"ERRORE\")))","v":0},null,0,0,0,0,0,0,0,0,0,0,0,0,0,null,0,0,0,0,0,0,0,0,0,0,0,0,0]
["CAMERE DOPPIE",{"$f":"+IF(B$3=\"ALTA\",'1) INPUT BASE'!$D$18,IF(B$3=\"MEDIA\",'1) INPUT BASE'!$E$18,IF(B$3=\"BASSA\",'1) INPUT BASE'!$F$18,\"ERRORE\")))","v":50},{"$f":"+IF(C$3=\"ALTA\",'1) INPUT BASE'!$D$18,IF(C$3=\"MEDIA\",'1) INPUT BASE'!$E$18,IF(C$3=\"BASSA\",'1) INPUT BASE'!$F$18,\"ERRORE\")))","v":70},{"$f":"+IF(D$3=\"ALTA\",'1) INPUT BASE'!$D$18,IF(D$3=\"MEDIA\",'1) INPUT BASE'!$E$18,IF(D$3=\"BASSA\",'1) INPUT BASE'!$F$18,\"ERRORE\")))","v":90},{"$f":"+IF(E$3=\"ALTA\",'1) INPUT BASE'!$D$18,IF(E$3=\"MEDIA\",'1) INPUT BASE'!$E$18,IF(E$3=\"BASSA\",'1) INPUT BASE'!$F$18,\"ERRORE\")))","v":90},{"$f":"+IF(F$3=\"ALTA\",'1) INPUT BASE'!$D$18,IF(F$3=\"MEDIA\",'1) INPUT BASE'!$E$18,IF(F$3=\"BASSA\",'1) INPUT BASE'!$F$18,\"ERRORE\")))","v":90},{"$f":"+IF(G$3=\"ALTA\",'1) INPUT BASE'!$D$18,IF(G$3=\"MEDIA\",'1) INPUT BASE'!$E$18,IF(G$3=\"BASSA\",'1) INPUT BASE'!$F$18,\"ERRORE\")))","v":70},{"$f":"+IF(H$3=\"ALTA\",'1) INPUT BASE'!$D$18,IF(H$3=\"MEDIA\",'1) INPUT BASE'!$E$18,IF(H$3=\"BASSA\",'1) INPUT BASE'!$F$18,\"ERRORE\")))","v":50},{"$f":"+IF(I$3=\"ALTA\",'1) INPUT BASE'!$D$18,IF(I$3=\"MEDIA\",'1) INPUT BASE'!$E$18,IF(I$3=\"BASSA\",'1) INPUT BASE'!$F$18,\"ERRORE\")))","v":50},{"$f":"+IF(J$3=\"ALTA\",'1) INPUT BASE'!$D$18,IF(J$3=\"MEDIA\",'1) INPUT BASE'!$E$18,IF(J$3=\"BASSA\",'1) INPUT BASE'!$F$18,\"ERRORE\")))","v":90},{"$f":"+IF(K$3=\"ALTA\",'1) INPUT BASE'!$D$18,IF(K$3=\"MEDIA\",'1) INPUT BASE'!$E$18,IF(K$3=\"BASSA\",'1) INPUT BASE'!$F$18,\"ERRORE\")))","v":50},{"$f":"+IF(L$3=\"ALTA\",'1) INPUT BASE'!$D$18,IF(L$3=\"MEDIA\",'1) INPUT BASE'!$E$18,IF(L$3=\"BASSA\",'1) INPUT BASE'!$F$18,\"ERRORE\")))","v":50},{"$f":"+IF(M$3=\"ALTA\",'1) INPUT BASE'!$D$18,IF(M$3=\"MEDIA\",'1) INPUT BASE'!$E$18,IF(M$3=\"BASSA\",'1) INPUT BASE'!$F$18,\"ERRORE\")))","v":50},null,0,50,70,90,90,90,70,50,50,90,50,50,50,null,0,50,70,90,90,90,70,50,50,90,50,50,50]
["CAMERE SINGOLE",{"$f":"+IF(B$3=\"ALTA\",'1) INPUT BASE'!$D$19,IF(B$3=\"MEDIA\",'1) INPUT BASE'!$E$19,IF(B$3=\"BASSA\",'1) INPUT BASE'!$F$19,\"ERRORE\")))","v":0},{"$f":"+IF(C$3=\"ALTA\",'1) INPUT BASE'!$D$19,IF(C$3=\"MEDIA\",'1) INPUT BASE'!$E$19,IF(C$3=\"BASSA\",'1) INPUT BASE'!$F$19,\"ERRORE\")))","v":0},{"$f":"+IF(D$3=\"ALTA\",'1) INPUT BASE'!$D$19,IF(D$3=\"MEDIA\",'1) INPUT BASE'!$E$19,IF(D$3=\"BASSA\",'1) INPUT BASE'!$F$19,\"ERRORE\")))","v":0},{"$f":"+IF(E$3=\"ALTA\",'1) INPUT BASE'!$D$19,IF(E$3=\"MEDIA\",'1) INPUT BASE'!$E$19,IF(E$3=\"BASSA\",'1) INPUT BASE'!$F$19,\"ERRORE\")))","v":0},{"$f":"+IF(F$3=\"ALTA\",'1) INPUT BASE'!$D$19,IF(F$3=\"MEDIA\",'1) INPUT BASE'!$E$19,IF(F$3=\"BASSA\",'1) INPUT BASE'!$F$19,\"ERRORE\")))","v":0},{"$f":"+IF(G$3=\"ALTA\",'1) INPUT BASE'!$D$19,IF(G$3=\"MEDIA\",'1) INPUT BASE'!$E$19,IF(G$3=\"BASSA\",'1) INPUT BASE'!$F$19,\"ERRORE\")))","v":0},{"$f":"+IF(H$3=\"ALTA\",'1) INPUT BASE'!$D$19,IF(H$3=\"MEDIA\",'1) INPUT BASE'!$E$19,IF(H$3=\"BASSA\",'1) INPUT BASE'!$F$19,\"ERRORE\")))","v":0},{"$f":"+IF(I$3=\"ALTA\",'1) INPUT BASE'!$D$19,IF(I$3=\"MEDIA\",'1) INPUT BASE'!$E$19,IF(I$3=\"BASSA\",'1) INPUT BASE'!$F$19,\"ERRORE\")))","v":0},{"$f":"+IF(J$3=\"ALTA\",'1) INPUT BASE'!$D$19,IF(J$3=\"MEDIA\",'1) INPUT BASE'!$E$19,IF(J$3=\"BASSA\",'1) INPUT BASE'!$F$19,\"ERRORE\")))","v":0},{"$f":"+IF(K$3=\"ALTA\",'1) INPUT BASE'!$D$19,IF(K$3=\"MEDIA\",'1) INPUT BASE'!$E$19,IF(K$3=\"BASSA\",'1) INPUT BASE'!$F$19,\"ERRORE\")))","v":0},{"$f":"+IF(L$3=\"ALTA\",'1) INPUT BASE'!$D$19,IF(L$3=\"MEDIA\",'1) INPUT BASE'!$E$19,IF(L$3=\"BASSA\",'1) INPUT BASE'!$F$19,\"ERRORE\")))","v":0},{"$f":"+IF(M$3=\"ALTA\",'1) INPUT BASE'!$D$19,IF(M$3=\"MEDIA\",'1) INPUT BASE'!$E$19,IF(M$3=\"BASSA\",'1) INPUT BASE'!$F$19,\"ERRORE\")))","v":0},null,0,0,0,0,0,0,0,0,0,0,0,0,0,null,0,0,0,0,0,0,0,0,0,0,0,0,0]
["VISITE GUIDATE",{"$f":"+IF(B$3=\"ALTA\",'1) INPUT BASE'!$D$20,IF(B$3=\"MEDIA\",'1) INPUT BASE'!$E$20,IF(B$3=\"BASSA\",'1) INPUT BASE'!$F$20,\"ERRORE\")))","v":0},{"$f":"+IF(C$3=\"ALTA\",'1) INPUT BASE'!$D$20,IF(C$3=\"MEDIA\",'1) INPUT BASE'!$E$20,IF(C$3=\"BASSA\",'1) INPUT BASE'!$F$20,\"ERRORE\")))","v":0},{"$f":"+IF(D$3=\"ALTA\",'1) INPUT BASE'!$D$20,IF(D$3=\"MEDIA\",'1) INPUT BASE'!$E$20,IF(D$3=\"BASSA\",'1) INPUT BASE'!$F$20,\"ERRORE\")))","v":0},{"$f":"+IF(E$3=\"ALTA\",'1) INPUT BASE'!$D$20,IF(E$3=\"MEDIA\",'1) INPUT BASE'!$E$20,IF(E$3=\"BASSA\",'1) INPUT BASE'!$F$20,\"ERRORE\")))","v":0},{"$f":"+IF(F$3=\"ALTA\",'1) INPUT BASE'!$D$20,IF(F$3=\"MEDIA\",'1) INPUT BASE'!$E$20,IF(F$3=\"BASSA\",'1) INPUT BASE'!$F$20,\"ERRORE\")))","v":0},{"$f":"+IF(G$3=\"ALTA\",'1) INPUT BASE'!$D$20,IF(G$3=\"MEDIA\",'1) INPUT BASE'!$E$20,IF(G$3=\"BASSA\",'1) INPUT BASE'!$F$20,\"ERRORE\")))","v":0},{"$f":"+IF(H$3=\"ALTA\",'1) INPUT BASE'!$D$20,IF(H$3=\"MEDIA\",'1) INPUT BASE'!$E$20,IF(H$3=\"BASSA\",'1) INPUT BASE'!$F$20,\"ERRORE\")))","v":0},{"$f":"+IF(I$3=\"ALTA\",'1) INPUT BASE'!$D$20,IF(I$3=\"MEDIA\",'1) INPUT BASE'!$E$20,IF(I$3=\"BASSA\",'1) INPUT BASE'!$F$20,\"ERRORE\")))","v":0},{"$f":"+IF(J$3=\"ALTA\",'1) INPUT BASE'!$D$20,IF(J$3=\"MEDIA\",'1) INPUT BASE'!$E$20,IF(J$3=\"BASSA\",'1) INPUT BASE'!$F$20,\"ERRORE\")))","v":0},{"$f":"+IF(K$3=\"ALTA\",'1) INPUT BASE'!$D$20,IF(K$3=\"MEDIA\",'1) INPUT BASE'!$E$20,IF(K$3=\"BASSA\",'1) INPUT BASE'!$F$20,\"ERRORE\")))","v":0},{"$f":"+IF(L$3=\"ALTA\",'1) INPUT BASE'!$D$20,IF(L$3=\"MEDIA\",'1) INPUT BASE'!$E$20,IF(L$3=\"BASSA\",'1) INPUT BASE'!$F$20,\"ERRORE\")))","v":0},{"$f":"+IF(M$3=\"ALTA\",'1) INPUT BASE'!$D$20,IF(M$3=\"MEDIA\",'1) INPUT BASE'!$E$20,IF(M$3=\"BASSA\",'1) INPUT BASE'!$F$20,\"ERRORE\")))","v":0},null,0,0,0,0,0,0,0,0,0,0,0,0,0,null,0,0,0,0,0,0,0,0,0,0,0,0,0]
["Altri ricavi",{"$f":"+IF(B$3=\"ALTA\",'1) INPUT BASE'!$D$21,IF(B$3=\"MEDIA\",'1) INPUT BASE'!$E$21,IF(B$3=\"BASSA\",'1) INPUT BASE'!$F$21,\"ERRORE\")))","v":0},{"$f":"+IF(C$3=\"ALTA\",'1) INPUT BASE'!$D$21,IF(C$3=\"MEDIA\",'1) INPUT BASE'!$E$21,IF(C$3=\"BASSA\",'1) INPUT BASE'!$F$21,\"ERRORE\")))","v":0},{"$f":"+IF(D$3=\"ALTA\",'1) INPUT BASE'!$D$21,IF(D$3=\"MEDIA\",'1) INPUT BASE'!$E$21,IF(D$3=\"BASSA\",'1) INPUT BASE'!$F$21,\"ERRORE\")))","v":0},{"$f":"+IF(E$3=\"ALTA\",'1) INPUT BASE'!$D$21,IF(E$3=\"MEDIA\",'1) INPUT BASE'!$E$21,IF(E$3=\"BASSA\",'1) INPUT BASE'!$F$21,\"ERRORE\")))","v":0},{"$f":"+IF(F$3=\"ALTA\",'1) INPUT BASE'!$D$21,IF(F$3=\"MEDIA\",'1) INPUT BASE'!$E$21,IF(F$3=\"BASSA\",'1) INPUT BASE'!$F$21,\"ERRORE\")))","v":0},{"$f":"+IF(G$3=\"ALTA\",'1) INPUT BASE'!$D$21,IF(G$3=\"MEDIA\",'1) INPUT BASE'!$E$21,IF(G$3=\"BASSA\",'1) INPUT BASE'!$F$21,\"ERRORE\")))","v":0},{"$f":"+IF(H$3=\"ALTA\",'1) INPUT BASE'!$D$21,IF(H$3=\"MEDIA\",'1) INPUT BASE'!$E$21,IF(H$3=\"BASSA\",'1) INPUT BASE'!$F$21,\"ERRORE\")))","v":0},{"$f":"+IF(I$3=\"ALTA\",'1) INPUT BASE'!$D$21,IF(I$3=\"MEDIA\",'1) INPUT BASE'!$E$21,IF(I$3=\"BASSA\",'1) INPUT BASE'!$F$21,\"ERRORE\")))","v":0},{"$f":"+IF(J$3=\"ALTA\",'1) INPUT BASE'!$D$21,IF(J$3=\"MEDIA\",'1) INPUT BASE'!$E$21,IF(J$3=\"BASSA\",'1) INPUT BASE'!$F$21,\"ERRORE\")))","v":0},{"$f":"+IF(K$3=\"ALTA\",'1) INPUT BASE'!$D$21,IF(K$3=\"MEDIA\",'1) INPUT BASE'!$E$21,IF(K$3=\"BASSA\",'1) INPUT BASE'!$F$21,\"ERRORE\")))","v":0},{"$f":"+IF(L$3=\"ALTA\",'1) INPUT BASE'!$D$21,IF(L$3=\"MEDIA\",'1) INPUT BASE'!$E$21,IF(L$3=\"BASSA\",'1) INPUT BASE'!$F$21,\"ERRORE\")))","v":0},{"$f":"+IF(M$3=\"ALTA\",'1) INPUT BASE'!$D$21,IF(M$3=\"MEDIA\",'1) INPUT BASE'!$E$21,IF(M$3=\"BASSA\",'1) INPUT BASE'!$F$21,\"ERRORE\")))","v":0},null,0,0,0,0,0,0,0,0,0,0,0,0,0,null,0,0,0,0,0,0,0,0,0,0,0,0,0]
["Altri ricavi",{"$f":"+IF(B$3=\"ALTA\",'1) INPUT BASE'!$D$22,IF(B$3=\"MEDIA\",'1) INPUT BASE'!$E$22,IF(B$3=\"BASSA\",'1) INPUT BASE'!$F$22,\"ERRORE\")))","v":0},{"$f":"+IF(C$3=\"ALTA\",'1) INPUT BASE'!$D$22,IF(C$3=\"MEDIA\",'1) INPUT BASE'!$E$22,IF(C$3=\"BASSA\",'1) INPUT BASE'!$F$22,\"ERRORE\")))","v":0},{"$f":"+IF(D$3=\"ALTA\",'1) INPUT BASE'!$D$22,IF(D$3=\"MEDIA\",'1) INPUT BASE'!$E$22,IF(D$3=\"BASSA\",'1) INPUT BASE'!$F$22,\"ERRORE\")))","v":0},{"$f":"+IF(E$3=\"ALTA\",'1) INPUT BASE'!$D$22,IF(E$3=\"MEDIA\",'1) INPUT BASE'!$E$22,IF(E$3=\"BASSA\",'1) INPUT BASE'!$F$22,\"ERRORE\")))","v":0},{"$f":"+IF(F$3=\"ALTA\",'1) INPUT BASE'!$D$22,IF(F$3=\"MEDIA\",'1) INPUT BASE'!$E$22,IF(F$3=\"BASSA\",'1) INPUT BASE'!$F$22,\"ERRORE\")))","v":0},{"$f":"+IF(G$3=\"ALTA\",'1) INPUT BASE'!$D$22,IF(G$3=\"MEDIA\",'1) INPUT BASE'!$E$22,IF(G$3=\"BASSA\",'1) INPUT BASE'!$F$22,\"ERRORE\")))","v":0},{"$f":"+IF(H$3=\"ALTA\",'1) INPUT BASE'!$D$22,IF(H$3=\"MEDIA\",'1) INPUT BASE'!$E$22,IF(H$3=\"BASSA\",'1) INPUT BASE'!$F$22,\"ERRORE\")))","v":0},{"$f":"+IF(I$3=\"ALTA\",'1) INPUT BASE'!$D$22,IF(I$3=\"MEDIA\",'1) INPUT BASE'!$E$22,IF(I$3=\"BASSA\",'1) INPUT BASE'!$F$22,\"ERRORE\")))","v":0},{"$f":"+IF(J$3=\"ALTA\",'1) INPUT BASE'!$D$22,IF(J$3=\"MEDIA\",'1) INPUT BASE'!$E$22,IF(J$3=\"BASSA\",'1) INPUT BASE'!$F$22,\"ERRORE\")))","v":0},{"$f":"+IF(K$3=\"ALTA\",'1) INPUT BASE'!$D$22,IF(K$3=\"MEDIA\",'1) INPUT BASE'!$E$22,IF(K$3=\"BASSA\",'1) INPUT BASE'!$F$22,\"ERRORE\")))","v":0},{"$f":"+IF(L$3=\"ALTA\",'1) INPUT BASE'!$D$22,IF(L$3=\"MEDIA\",'1) INPUT BASE'!$E$22,IF(L$3=\"BASSA\",'1) INPUT BASE'!$F$22,\"ERRORE\")))","v":0},{"$f":"+IF(M$3=\"ALTA\",'1) INPUT BASE'!$D$22,IF(M$3=\"MEDIA\",'1) INPUT BASE'!$E$22,IF(M$3=\"BASSA\",'1) INPUT BASE'!$F$22,\"ERRORE\")))","v":0},null,0,0,0,0,0,0,0,0,0,0,0,0,0,null,0,0,0,0,0,0,0,0,0,0,0,0,0]
["Altri ricavi",{"$f":"+IF(B$3=\"ALTA\",'1) INPUT BASE'!$D$23,IF(B$3=\"MEDIA\",'1) INPUT BASE'!$E$23,IF(B$3=\"BASSA\",'1) INPUT BASE'!$F$23,\"ERRORE\")))","v":0},{"$f":"+IF(C$3=\"ALTA\",'1) INPUT BASE'!$D$23,IF(C$3=\"MEDIA\",'1) INPUT BASE'!$E$23,IF(C$3=\"BASSA\",'1) INPUT BASE'!$F$23,\"ERRORE\")))","v":0},{"$f":"+IF(D$3=\"ALTA\",'1) INPUT BASE'!$D$23,IF(D$3=\"MEDIA\",'1) INPUT BASE'!$E$23,IF(D$3=\"BASSA\",'1) INPUT BASE'!$F$23,\"ERRORE\")))","v":0},{"$f":"+IF(E$3=\"ALTA\",'1) INPUT BASE'!$D$23,IF(E$3=\"MEDIA\",'1) INPUT BASE'!$E$23,IF(E$3=\"BASSA\",'1) INPUT BASE'!$F$23,\"ERRORE\")))","v":0},{"$f":"+IF(F$3=\"ALTA\",'1) INPUT BASE'!$D$23,IF(F$3=\"MEDIA\",'1) INPUT BASE'!$E$23,IF(F$3=\"BASSA\",'1) INPUT BASE'!$F$23,\"ERRORE\")))","v":0},{"$f":"+IF(G$3=\"ALTA\",'1) INPUT BASE'!$D$23,IF(G$3=\"MEDIA\",'1) INPUT BASE'!$E$23,IF(G$3=\"BASSA\",'1) INPUT BASE'!$F$23,\"ERRORE\")))","v":0},{"$f":"+IF(H$3=\"ALTA\",'1) INPUT BASE'!$D$23,IF(H$3=\"MEDIA\",'1) INPUT BASE'!$E$23,IF(H$3=\"BASSA\",'1) INPUT BASE'!$F$23,\"ERRORE\")))","v":0},{"$f":"+IF(I$3=\"ALTA\",'1) INPUT BASE'!$D$23,IF(I$3=\"MEDIA\",'1) INPUT BASE'!$E$23,IF(I$3=\"BASSA\",'1) INPUT BASE'!$F$23,\"ERRORE\")))","v":0},{"$f":"+IF(J$3=\"ALTA\",'1) INPUT BASE'!$D$23,IF(J$3=\"MEDIA\",'1) INPUT BASE'!$E$23,IF(J$3=\"BASSA\",'1) INPUT BASE'!$F$23,\"ERRORE\")))","v":0},{"$f":"+IF(K$3=\"ALTA\",'1) INPUT BASE'!$D$23,IF(K$3=\"MEDIA\",'1) INPUT BASE'!$E$23,IF(K$3=\"BASSA\",'1) INPUT BASE'!$F$23,\"ERRORE\")))","v":0},{"$f":"+IF(L$3=\"ALTA\",'1) INPUT BASE'!$D$23,IF(L$3=\"MEDIA\",'1) INPUT BASE'!$E$23,IF(L$3=\"BASSA\",'1) INPUT BASE'!$F$23,\"ERRORE\")))","v":0},{"$f":"+IF(M$3=\"ALTA\",'1) INPUT BASE'!$D$23,IF(M$3=\"MEDIA\",'1) INPUT BASE'!$E$23,IF(M$3=\"BASSA\",'1) INPUT BASE'!$F$23,\"ERRORE\")))","v":0},null,0,0,0,0,0,0,0,0,0,0,0,0,0,null,0,0,0,0,0,0,0,0,0,0,0,0,0]
["Altri ricavi",{"$f":"+IF(B$3=\"ALTA\",'1) INPUT BASE'!$D$24,IF(B$3=\"MEDIA\",'1) INPUT BASE'!$E$24,IF(B$3=\"BASSA\",'1) INPUT BASE'!$F$24,\"ERRORE\")))","v":0},{"$f":"+IF(C$3=\"ALTA\",'1) INPUT BASE'!$D$24,IF(C$3=\"MEDIA\",'1) INPUT BASE'!$E$24,IF(C$3=\"BASSA\",'1) INPUT BASE'!$F$24,\"ERRORE\")))","v":0},{"$f":"+IF(D$3=\"ALTA\",'1) INPUT BASE'!$D$24,IF(D$3=\"MEDIA\",'1) INPUT BASE'!$E$24,IF(D$3=\"BASSA\",'1) INPUT BASE'!$F$24,\"ERRORE\")))","v":0},{"$f":"+IF(E$3=\"ALTA\",'1) INPUT BASE'!$D$24,IF(E$3=\"MEDIA\",'1) INPUT BASE'!$E$24,IF(E$3=\"BASSA\",'1) INPUT BASE'!$F$24,\"ERRORE\")))","v":0},{"$f":"+IF(F$3=\"ALTA\",'1) INPUT BASE'!$D$24,IF(F$3=\"MEDIA\",'1) INPUT BASE'!$E$24,IF(F$3=\"BASSA\",'1) INPUT BASE'!$F$24,\"ERRORE\")))","v":0},{"$f":"+IF(G$3=\"ALTA\",'1) INPUT BASE'!$D$24,IF(G$3=\"MEDIA\",'1) INPUT BASE'!$E$24,IF(G$3=\"BASSA\",'1) INPUT BASE'!$F$24,\"ERRORE\")))","v":0},{"$f":"+IF(H$3=\"ALTA\",'1) INPUT BASE'!$D$24,IF(H$3=\"MEDIA\",'1) INPUT BASE'!$E$24,IF(H$3=\"BASSA\",'1) INPUT BASE'!$F$24,\"ERRORE\")))","v":0},{"$f":"+IF(I$3=\"ALTA\",'1) INPUT BASE'!$D$24,IF(I$3=\"MEDIA\",'1) INPUT BASE'!$E$24,IF(I$3=\"BASSA\",'1) INPUT BASE'!$F$24,\"ERRORE\")))","v":0},{"$f":"+IF(J$3=\"ALTA\",'1) INPUT BASE'!$D$24,IF(J$3=\"MEDIA\",'1) INPUT BASE'!$E$24,IF(J$3=\"BASSA\",'1) INPUT BASE'!$F$24,\"ERRORE\")))","v":0},{"$f":"+IF(K$3=\"ALTA\",'1) INPUT BASE'!$D$24,IF(K$3=\"MEDIA\",'1) INPUT BASE'!$E$24,IF(K$3=\"BASSA\",'1) INPUT BASE'!$F$24,\"ERRORE\")))","v":0},{"$f":"+IF(L$3=\"ALTA\",'1) INPUT BASE'!$D$24,IF(L$3=\"MEDIA\",'1) INPUT BASE'!$E$24,IF(L$3=\"BASSA\",'1) INPUT BASE'!$F$24,\"ERRORE\")))","v":0},{"$f":"+IF(M$3=\"ALTA\",'1) INPUT BASE'!$D$24,IF(M$3=\"MEDIA\",'1) INPUT BASE'!$E$24,IF(M$3=\"BASSA\",'1) INPUT BASE'!$F$24,\"ERRORE\")))","v":0},null,0,0,0,0,0,0,0,0,0,0,0,0,0,null,0,0,0,0,0,0,0,0,0,0,0,0,0]
["Altri ricavi",{"$f":"+IF(B$3=\"ALTA\",'1) INPUT BASE'!$D$25,IF(B$3=\"MEDIA\",'1) INPUT BASE'!$E$25,IF(B$3=\"BASSA\",'1) INPUT BASE'!$F$25,\"ERRORE\")))","v":0},{"$f":"+IF(C$3=\"ALTA\",'1) INPUT BASE'!$D$25,IF(C$3=\"MEDIA\",'1) INPUT BASE'!$E$25,IF(C$3=\"BASSA\",'1) INPUT BASE'!$F$25,\"ERRORE\")))","v":0},{"$f":"+IF(D$3=\"ALTA\",'1) INPUT BASE'!$D$25,IF(D$3=\"MEDIA\",'1) INPUT BASE'!$E$25,IF(D$3=\"BASSA\",'1) INPUT BASE'!$F$25,\"ERRORE\")))","v":0},{"$f":"+IF(E$3=\"ALTA\",'1) INPUT BASE'!$D$25,IF(E$3=\"MEDIA\",'1) INPUT BASE'!$E$25,IF(E$3=\"BASSA\",'1) INPUT BASE'!$F$25,\"ERRORE\")))","v":0},{"$f":"+IF(F$3=\"ALTA\",'1) INPUT BASE'!$D$25,IF(F$3=\"MEDIA\",'1) INPUT BASE'!$E$25,IF(F$3=\"BASSA\",'1) INPUT BASE'!$F$25,\"ERRORE\")))","v":0},{"$f":"+IF(G$3=\"ALTA\",'1) INPUT BASE'!$D$25,IF(G$3=\"MEDIA\",'1) INPUT BASE'!$E$25,IF(G$3=\"BASSA\",'1) INPUT BASE'!$F$25,\"ERRORE\")))","v":0},{"$f":"+IF(H$3=\"ALTA\",'1) INPUT BASE'!$D$25,IF(H$3=\"MEDIA\",'1) INPUT BASE'!$E$25,IF(H$3=\"BASSA\",'1) INPUT BASE'!$F$25,\"ERRORE\")))","v":0},{"$f":"+IF(I$3=\"ALTA\",'1) INPUT BASE'!$D$25,IF(I$3=\"MEDIA\",'1) INPUT BASE'!$E$25,IF(I$3=\"BASSA\",'1) INPUT BASE'!$F$25,\"ERRORE\")))","v":0},{"$f":"+IF(J$3=\"ALTA\",'1) INPUT BASE'!$D$25,IF(J$3=\"MEDIA\",'1) INPUT BASE'!$E$25,IF(J$3=\"BASSA\",'1) INPUT BASE'!$F$25,\"ERRORE\")))","v":0},{"$f":"+IF(K$3=\"ALTA\",'1) INPUT BASE'!$D$25,IF(K$3=\"MEDIA\",'1) INPUT BASE'!$E$25,IF(K$3=\"BASSA\",'1) INPUT BASE'!$F$25,\"ERRORE\")))","v":0},{"$f":"+IF(L$3=\"ALTA\",'1) INPUT BASE'!$D$25,IF(L$3=\"MEDIA\",'1) INPUT BASE'!$E$25,IF(L$3=\"BASSA\",'1) INPUT BASE'!$F$25,\"ERRORE\")))","v":0},{"$f":"+IF(M$3=\"ALTA\",'1) INPUT BASE'!$D$25,IF(M$3=\"MEDIA\",'1) INPUT BASE'!$E$25,IF(M$3=\"BASSA\",'1) INPUT BASE'!$F$25,\"ERRORE\")))","v":0},null,0,{"$f":"+(1+$O49)*B49","v":0},{"$f":"+(1+$O49)*C49","v":0},{"$f":"+(1+$O49)*D49","v":0},{"$f":"+(1+$O49)*E49","v":0},{"$f":"+(1+$O49)*F49","v":0},{"$f":"+(1+$O49)*G49","v":0},{"$f":"+(1+$O49)*H49","v":0},{"$f":"+(1+$O49)*I49","v":0},{"$f":"+(1+$O49)*J49","v":0},{"$f":"+(1+$O49)*K49","v":0},{"$f":"+(1+$O49)*L49","v":0},{"$f":"+(1+$O49)*M49","v":0},null,0,{"$f":"+(1+$AC49)*P49","v":0},{"$f":"+(1+$AC49)*Q49","v":0},{"$f":"+(1+$AC49)*R49","v":0},{"$f":"+(1+$AC49)*S49","v":0},{"$f":"+(1+$AC49)*T49","v":0},{"$f":"+(1+$AC49)*U49","v":0},{"$f":"+(1+$AC49)*V49","v":0},{"$f":"+(1+$AC49)*W49","v":0},{"$f":"+(1+$AC49)*X49","v":0},{"$f":"+(1+$AC49)*Y49","v":0},{"$f":"+(1+$AC49)*Z49","v":0},{"$f":"+(1+$AC49)*AA49","v":0}]

{"sheet":"4) INPUT INPS","index":3,"n_rows":23,"n_cols":38,"rows_kept":23,"cut":false,"hidden":false,"merged":[[1,17,1,21],[16,17,16,18],[1,10,1,11],[0,1,0,5]]}
[null,"INPUT INPS"]
[null,"CONTRIBUTI",{"$f":"+'1) INPUT BASE'!C11","v":2016},{"$f":"+C2+1","v":2017},{"$f":"+D2+1","v":2018},{"$f":"+E2+1","v":2019},null,null,"RATE CONTRIBUTI FISSI",null,{"$f":"+R17","v":"B&B NO IMPRENDITORIALE"},null,null,null,null,null,null,"CONTRIBUTI A PERCENTUALE",null,null,null,null,"REDDITO IMPONIBILE N-1","REDDITO MINIMALE N-1","CONTRIBUTI SU MINIMALE","IMPONIBILE II SCAGLIONE","CONTRIBUTI II SCAGLIONE","MASSIMALE","IMPONIBILE III SCAGLIONE","CONTRIBUTI III SCAGLIONE","DIVISORE","CONTRIBUTI DOVUTI","ACCONTI VERSATI","SALDO DA VERSARE","CREDITO","ACC.TO DA VERSARE","USCITE","CREDITO RESIDUO"]
[null,"ALIQUOTA  ENTRO SCAGLIONE",0.2319,0.2319,0.2319,0.2319,null,null,null,null,null,{"$f":"+'4) INPUT INPS'!C2","v":2016},null,"TRIMESTRI","MESI CONTRIBUZIONE"]
[null,"ALIQUOTA OLTRE SCAGLIONE",0.2419,0.2419,0.2419,0.2419,null,null,16,"MAGGIO",{"$f":"+DATE(L3,5,31)","v":"2016-05-31"},{"$f":"IF(K2=\"AFFITTACAMERE\",0,IF(O4=0,0,'4) INPUT INPS'!$C$14*'4) INPUT INPS'!O4))","v":0},null,{"$f":"+DATE(L3,3,31)","v":"2016-03-31"},{"$f":"IFERROR(IF(DATEDIF(DATE($L$3,'1) INPUT BASE'!$C$12,1)-10,N4,\"M\")>3,3,DATEDIF(DATE($L$3,'1) INPUT BASE'!$C$12,1)-10,N4,\"M\")),0)","v":0},null,null,16,"GIUGNO",{"$f":"+L3","v":2016},{"$f":"+DATE(T4,12,31)","v":"2016-12-31"},{"$f":"+DATE(L3,6,30)","v":"2016-06-30"},0,0,0,{"$f":"IF(W4>X4,W4-X4,0)","v":0},0,0,0,0]
[null,"LIMITE SCAGLIONE CONTRIBUTIVO",46123,{"$f":"+C5","v":46123},{"$f":"+D5","v":46123},{"$f":"+E5","v":46123},null,null,20,"AGOSTO",{"$f":"+DATE(L3,8,31)","v":"2016-08-31"},{"$f":"IF(K2=\"AFFITTACAMERE\",0,IF(O5=0,0,'4) INPUT INPS'!$C$14*'4) INPUT INPS'!O5))","v":0},null,{"$f":"+DATE(L3,6,30)","v":"2016-06-30"},{"$f":"IFERROR(IF(DATEDIF(DATE($L$3,'1) INPUT BASE'!$C$12,1)-10,N5,\"M\")>3,3,DATEDIF(DATE($L$3,'1) INPUT BASE'!$C$12,1)-10,N5,\"M\")),0)","v":3},null,null,30,"NOVEMBRE",{"$f":"+T4","v":2016},{"$f":"+DATE(T5,12,31)","v":"2016-12-31"},{"$f":"+DATE(L3,11,30)","v":"2016-11-30"}]
[null,"REDDITO MINIMO CALCOLO IVS",15548,15548,15548,15548,null,null,16,"NOVEMBRE",{"$f":"+DATE(L3,11,30)","v":"2016-11-30"},{"$f":"IF(K2=\"AFFITTACAMERE\",0,IF(O6=0,0,'4) INPUT INPS'!$C$14*'4) INPUT INPS'!O6))","v":0},null,{"$f":"+DATE(L3,9,30)","v":"2016-09-30"},{"$f":"IFERROR(IF(DATEDIF(DATE($L$3,'1) INPUT BASE'!$C$12,1)-10,N6,\"M\")>3,3,DATEDIF(DATE($L$3,'1) INPUT BASE'!$C$12,1)-10,N6,\"M\")),0)","v":3}]
[null,"CONTRIBUTO MATERNITA'",7.44,7.44,7.44,7.44,null,null,16,"FEBBRAIO n+1",{"$f":"+DATE(L3+1,2,28)","v":"2017-02-28"},{"$f":"IF(K2=\"AFFITTACAMERE\",0,IF('4) INPUT INPS'!C16-'4) INPUT INPS'!L4-'4) INPUT INPS'!L5-'4) INPUT INPS'!L6<0,0,'4) INPUT INPS'!C16-'4) INPUT INPS'!L4-'4) INPUT INPS'!L5-'4) INPUT INPS'!L6))","v":0},null,{"$f":"+DATE(L3,12,31)","v":"2016-12-31"},{"$f":"IFERROR(IF(DATEDIF(DATE($L$3,'1) INPUT BASE'!$C$12,1)-10,N7,\"M\")>3,3,DATEDIF(DATE($L$3,'1) INPUT BASE'!$C$12,1)-10,N7,\"M\")),0)","v":3},null,null,16,"GIUGNO",{"$f":"+L8","v":2017},{"$f":"+DATE(T7,12,31)","v":"2017-12-31"},{"$f":"+DATE(L8,6,30)","v":"2017-06-30"},{"$f":"+'3) INPUT VENDITE'!$CD$4*'1) INPUT BASE'!G6","v":10406.400000000001},{"$f":"+'4) INPUT INPS'!C6","v":15548},{"$f":"+IF('1) INPUT BASE'!C5=\"AFFITTACAMERE\",IF(X7<W7,'4) INPUT INPS'!X7*'4) INPUT INPS'!C10+C7/12*C15,'4) INPUT INPS'!W7*'4) INPUT INPS'!C10+C7/12*C15),0)","v":0},{"$f":"IF(W7>C5,C5-C6,IF(W7>X7,W7-X7,0))","v":0},{"$f":"+Z7*C10","v":0},{"$f":"+IF(C18=\"NO\",C8,C9)","v":100324},{"$f":"+IF(W7>C5,IF(W7>AB7,AB7-Z7-X7,W7-C5),0)","v":0},{"$f":"+AC7*C17","v":0},{"$f":"+IF(C19=\"SI\",0.5,1)","v":1},{"$f":"(AD7+AA7+Y7)*AE7","v":0},0,{"$f":"+AF7-AG7","v":0},{"$f":"+IF(AH7<0,-AH7,0)","v":0},{"$f":"+AF7*0.8/2","v":0},{"$f":"+IF(AJ7<0,0,AJ7+AH7)","v":0}]
[null,"MASSIMALE CONTRIBUTIVO SENZA ANZIANITA'",100324,100324,100324,100324,null,null,null,null,null,{"$f":"+'4) INPUT INPS'!D2","v":2017},null,null,null,null,null,30,"NOVEMBRE",{"$f":"+T7","v":2017},{"$f":"+DATE(T8,12,31)","v":"2017-12-31"},{"$f":"+DATE(L8,11,30)","v":"2017-11-30"},null,null,null,null,null,null,null,null,{"$f":"+AE7","v":1},null,null,null,null,{"$f":"+AJ7","v":0},{"$f":"+IF(AJ8<0,0,AJ8+AH8)","v":0}]
[null,"MASSIMALE CONTRIBUTIVO CON ANZIANITA'",76872,76872,76872,76872,null,null,16,"MAGGIO",{"$f":"+DATE(L8,5,31)","v":"2017-05-31"},{"$f":"IF(K2=\"AFFITTACAMERE\",0,'4) INPUT INPS'!D$13/4)","v":0},null,"DATA INZIO ATTIVITA'",{"$f":"+DATE(L3,'1) INPUT BASE'!C12,1)","v":"2016-04-01"}]
[null,"ALIQUOTA ENTRO SCAGLIONE CON RIDUZIONE",{"$f":"+C3*(1-C12)","v":0.15073500000000001},{"$f":"+D3*(1-D12)","v":0.15073500000000001},{"$f":"+E3*(1-E12)","v":0.15073500000000001},{"$f":"+F3*(1-F12)","v":0.15073500000000001},null,null,20,"AGOSTO",{"$f":"+DATE(L8,8,31)","v":"2017-08-31"},{"$f":"+L9","v":0},null,"FINE ANNO",{"$f":"+DATE(L3,12,31)","v":"2016-12-31"},null,null,16,"GIUGNO",{"$f":"+L13","v":2018},{"$f":"+DATE(T10,12,31)","v":"2018-12-31"},{"$f":"+DATE(L13,6,30)","v":"2018-06-30"},{"$f":"+'3) INPUT VENDITE'!$CD$5*'1) INPUT BASE'!G6","v":11126.400000000001},{"$f":"+'4) INPUT INPS'!D6","v":15548},{"$f":"+IF('1) INPUT BASE'!C5=\"AFFITTACAMERE\",IF(X10<W10,'4) INPUT INPS'!X10*'4) INPUT INPS'!D10+D7/12*D15,'4) INPUT INPS'!W10*'4) INPUT INPS'!D10+D7/12*D15),0)","v":0},{"$f":"+IF(W10>D5,D5-D6,IF(W10>X10,W10-X10,0))","v":0},{"$f":"+Z10*D10","v":0},{"$f":"+IF(D18=\"NO\",D8,D9)","v":100324},{"$f":"+IF(W10>D5,IF(W10>AB10,AB10-Z10-X10,W10-D5),0)","v":0},{"$f":"+AC10*D17","v":0},{"$f":"+IF(D19=\"SI\",0.5,1)","v":1},{"$f":"(AD10+AA10+Y10)*AE10","v":0},{"$f":"+AJ7+AJ8","v":0},{"$f":"+AF10-AG10","v":0},{"$f":"+IF(AH10<0,-AH10,0)","v":0},{"$f":"+AF10*0.8/2","v":0},0]
[null,"CONTRIBUZIONE MINIMA REGIME ORDINARIO",{"$f":"+C6*C3+7.44","v":3613.0212000000001},{"$f":"+D6*D3+7.44","v":3613.0212000000001},{"$f":"+E6*E3+7.44","v":3613.0212000000001},{"$f":"+F6*F3+7.44","v":3613.0212000000001},null,null,16,"NOVEMBRE",{"$f":"+DATE(L8,11,30)","v":"2017-11-30"},{"$f":"+L10","v":0},null,null,null,null,null,30,"NOVEMBRE",{"$f":"+T10","v":2018},{"$f":"+DATE(T11,12,31)","v":"2018-12-31"},{"$f":"+DATE(L13,11,30)","v":"2018-11-30"},null,null,null,null,null,null,null,null,null,null,null,null,null,{"$f":"+AJ10","v":0},0]
[null,"SCONTO PER REGIME FORFETTARIO",0.35,{"$f":"+C12","v":0.35},{"$f":"+D12","v":0.35},{"$f":"+E12","v":0.35},null,null,16,"FEBBRAIO n+1",{"$f":"+DATE(L8+1,2,28)","v":"2018-02-28"},{"$f":"+L11","v":0}]
[null,"CONTRIBUZIONE MINIMA SU BASE ANNUA ",{"$f":"IF('1) INPUT BASE'!$C$5=\"B&B NO IMPRENDITORIALE\",0,C10*C6+7.44)","v":0},{"$f":"IF('1) INPUT BASE'!$C$5=\"B&B NO IMPRENDITORIALE\",0,D10*D6+7.44)","v":0},{"$f":"IF('1) INPUT BASE'!$C$5=\"B&B NO IMPRENDITORIALE\",0,E10*E6+7.44)","v":0},{"$f":"IF('1) INPUT BASE'!$C$5=\"B&B NO IMPRENDITORIALE\",0,F10*F6+7.44)","v":0},null,null,null,null,null,{"$f":"+'4) INPUT INPS'!E2","v":2018},null,null,null,null,null,16,"GIUGNO",{"$f":"+L18","v":2019},{"$f":"+DATE(T13,12,31)","v":"2019-12-31"},{"$f":"+DATE(L18,6,30)","v":"2019-06-30"},{"$f":"+'3) INPUT VENDITE'!$CD$6*'1) INPUT BASE'!G6","v":11126.400000000001},{"$f":"+'4) INPUT INPS'!E6","v":15548},{"$f":"+IF('1) INPUT BASE'!C5=\"AFFITTACAMERE\",IF(X13<W13,'4) INPUT INPS'!X13*'4) INPUT INPS'!E10+E7/12*E15,'4) INPUT INPS'!W13*'4) INPUT INPS'!E10+E7/12*E15),0)","v":0},{"$f":"IF(W13>E5,E5-E6,IF(W13>X13,W13-X13,0))","v":0},{"$f":"+Z13*E10","v":0},{"$f":"+IF(E18=\"NO\",E8,E9)","v":100324},{"$f":"+IF(W13>E5,IF(W13>AB13,AB13-Z13-X13,W13-E5),0)","v":0},{"$f":"+AC13*E17","v":0},{"$f":"+IF(E19=\"SI\",0.5,1)","v":1},0,{"$f":"+AJ10+AJ11","v":0},{"$f":"+AF13-AG13","v":0},0,{"$f":"+AF13*0.8/2","v":0},0]
[null,"CONTRIBUZIONE MINIMA SU BASE MENSILE",{"$f":"IF('1) INPUT BASE'!$C$5=\"B&B NO IMPRENDITORIALE\",0,C13/12)","v":0},{"$f":"IF('1) INPUT BASE'!$C$5=\"B&B NO IMPRENDITORIALE\",0,D13/12)","v":0},{"$f":"IF('1) INPUT BASE'!$C$5=\"B&B NO IMPRENDITORIALE\",0,E13/12)","v":0},{"$f":"IF('1) INPUT BASE'!$C$5=\"B&B NO IMPRENDITORIALE\",0,F13/12)","v":0},null,null,16,"MAGGIO",{"$f":"+DATE(L13,5,31)","v":"2018-05-31"},{"$f":"IF(K2=\"AFFITTACAMERE\",0,'4) INPUT INPS'!E$13/4)","v":0},null,null,null,null,null,30,"NOVEMBRE",{"$f":"+T13","v":2019},{"$f":"+DATE(T14,12,31)","v":"2019-12-31"},{"$f":"+DATE(L18,11,30)","v":"2019-11-30"},null,null,null,null,null,null,null,null,null,null,null,null,null,{"$f":"+AJ13","v":0},0]
[null,"MESI ATTIVITA' ",{"$f":"DATEDIF(DATE(C2,'1) INPUT BASE'!C12,1)-1,DATE(C2,12,31),\"M\")","v":9},12,12,12,null,null,20,"AGOSTO",{"$f":"+DATE(L13,8,31)","v":"2018-08-31"},{"$f":"+L14","v":0}]
[null,"CONTRIBUTI FISSI DOVUTI",{"$f":"IF('1) INPUT BASE'!$C$5=\"B&B NO IMPRENDITORIALE\",0,C15*C14)","v":0},{"$f":"IF('1) INPUT BASE'!$C$5=\"B&B NO IMPRENDITORIALE\",0,D15*D14)","v":0},{"$f":"IF('1) INPUT BASE'!$C$5=\"B&B NO IMPRENDITORIALE\",0,E15*E14)","v":0},{"$f":"IF('1) INPUT BASE'!$C$5=\"B&B NO IMPRENDITORIALE\",0,F15*F14)","v":0},null,null,16,"NOVEMBRE",{"$f":"+DATE(L13,11,30)","v":"2018-11-30"},{"$f":"+L15","v":0}]
[null,"ALIQUOTA OLTRE SCAGLIONE ALIQUOTA FORFET",{"$f":"+C4*(1-C12)","v":0.15723500000000001},{"$f":"+D4*(1-D12)","v":0.15723500000000001},{"$f":"+E4*(1-E12)","v":0.15723500000000001},{"$f":"+F4*(1-F12)","v":0.15723500000000001},null,null,16,"FEBBRAIO n+1",{"$f":"+DATE(L13+1,2,28)","v":"2019-02-28"},{"$f":"+L16","v":0},null,null,null,null,null,{"$f":"+'1) INPUT BASE'!C5","v":"B&B NO IMPRENDITORIALE"}]
[null,"IL TITOLARE HA ANZIANITA' CONTRIBUTIVA?","NO",{"$f":"+C18","v":"NO"},{"$f":"+D18","v":"NO"},"NO",null,null,null,null,null,{"$f":"+L13+1","v":2019},null,null,null,null,null,"CONTRIBUTI VERSATI"]
[null,"IL TITOLARE HA ALMENO 65 ANNI ED E' IN PENSIONE?","NO",{"$f":"+C19","v":"NO"},{"$f":"+D19","v":"NO"},"NO",null,null,16,"MAGGIO",{"$f":"+DATE(L18,5,31)","v":"2019-05-31"},{"$f":"IF(K2=\"AFFITTACAMERE\",0,'4) INPUT INPS'!F$13/4)","v":0},null,null,null,null,null,{"$f":"+L3","v":2016},{"$f":"L4+L5+L6+AH4+AJ4+AJ5","v":0}]
[null,null,null,null,null,null,null,null,20,"AGOSTO",{"$f":"+DATE(L18,8,31)","v":"2019-08-31"},{"$f":"+L19","v":0},null,null,null,null,null,{"$f":"+L8","v":2017},{"$f":"L7+L9+L10+L11+AH7+AJ7+AJ8","v":0}]
[null,null,null,null,null,null,null,null,16,"NOVEMBRE",{"$f":"+DATE(L18,11,30)","v":"2019-11-30"},{"$f":"+L20","v":0},null,null,null,null,null,{"$f":"+L13","v":2018},{"$f":"AH10+AJ10+AJ11+L12+L14+L15+L16","v":0}]
[null,"Dati reperibili dal sito dell'inps. Fonte: http://www.inps.it/Circolari/Circolare%20numero%2015%20del%2029-01-2016.htm",null,null,null,null,null,null,16,"FEBBRAIO n+1",{"$f":"+DATE(L18+1,2,28)","v":"2020-02-28"},{"$f":"+L21","v":0},null,null,null,null,null,{"$f":"+L18","v":2019},{"$f":"AH13+AJ13+AJ14+L17+L19+L20+L21","v":0}]
[null,"Dati da inserire solo se attività imprenditoriale, non per b&b non imprenditoriale."]

{"sheet":"5) INPUT COSTI FISSI","index":4,"n_rows":36,"n_cols":42,"rows_kept":36,"cut":false,"hidden":false,"merged":[[0,1,0,12],[0,15,0,26],[0,29,0,40]]}
["INPUT COSTI FISSI","MESI",null,null,null,null,null,null,null,null,null,null,null,"ANNO 1",null,"MESI",null,null,null,null,null,null,null,null,null,null,null,"ANNO 2",null,"MESI",null,null,null,null,null,null,null,null,null,null,null,"ANNO 3"]
["PIANO DEI COSTI FISSI",{"$f":"EOMONTH(DATE('1) INPUT BASE'!C11,'1) INPUT BASE'!C12,1),0)","v":"2016-04-30"},{"$f":"+EOMONTH(B2,1)","v":"2016-05-31"},"2016-06-30","2016-07-31","2016-08-31","2016-09-30","2016-10-31","2016-11-30","2016-12-31","2017-01-31","2017-02-28","2017-03-31","TOTALE","IPOTESI %",{"$f":"+EOMONTH(M2,1)","v":"2017-04-30"},{"$f":"+EOMONTH(P2,1)","v":"2017-05-31"},"2017-06-30","2017-07-31","2017-08-31","2017-09-30","2017-10-31","2017-11-30","2017-12-31","2018-01-31","2018-02-28","2018-03-31","TOTALE","IPOTESI %",{"$f":"+EOMONTH(AA2,1)","v":"2018-04-30"},{"$f":"+EOMONTH(AD2,1)","v":"2018-05-31"},"2018-06-30","2018-07-31","2018-08-31","2018-09-30","2018-10-31","2018-11-30","2018-12-31","2019-01-31","2019-02-28","2019-03-31","TOTALE"]
["Contributi",{"$f":"_xlfn.IFNA(VLOOKUP(B2,'4) INPUT INPS'!$K$4:$L$22,2,FALSE),0)+_xlfn.IFNA(VLOOKUP(B2,'4) INPUT INPS'!$V$4:$AK$14,16,FALSE),0)","v":0},{"$f":"_xlfn.IFNA(VLOOKUP(C2,'4) INPUT INPS'!$K$4:$L$22,2,FALSE),0)+_xlfn.IFNA(VLOOKUP(C2,'4) INPUT INPS'!$V$4:$AK$14,16,FALSE),0)","v":0},{"$f":"_xlfn.IFNA(VLOOKUP(D2,'4) INPUT INPS'!$K$4:$L$22,2,FALSE),0)+_xlfn.IFNA(VLOOKUP(D2,'4) INPUT INPS'!$V$4:$AK$14,16,FALSE),0)","v":0},{"$f":"_xlfn.IFNA(VLOOKUP(E2,'4) INPUT INPS'!$K$4:$L$22,2,FALSE),0)+_xlfn.IFNA(VLOOKUP(E2,'4) INPUT INPS'!$V$4:$AK$14,16,FALSE),0)","v":0},{"$f":"_xlfn.IFNA(VLOOKUP(F2,'4) INPUT INPS'!$K$4:$L$22,2,FALSE),0)+_xlfn.IFNA(VLOOKUP(F2,'4) INPUT INPS'!$V$4:$AK$14,16,FALSE),0)","v":0},{"$f":"_xlfn.IFNA(VLOOKUP(G2,'4) INPUT INPS'!$K$4:$L$22,2,FALSE),0)+_xlfn.IFNA(VLOOKUP(G2,'4) INPUT INPS'!$V$4:$AK$14,16,FALSE),0)","v":0},{"$f":"_xlfn.IFNA(VLOOKUP(H2,'4) INPUT INPS'!$K$4:$L$22,2,FALSE),0)+_xlfn.IFNA(VLOOKUP(H2,'4) INPUT INPS'!$V$4:$AK$14,16,FALSE),0)","v":0},{"$f":"_xlfn.IFNA(VLOOKUP(I2,'4) INPUT INPS'!$K$4:$L$22,2,FALSE),0)+_xlfn.IFNA(VLOOKUP(I2,'4) INPUT INPS'!$V$4:$AK$14,16,FALSE),0)","v":0},{"$f":"_xlfn.IFNA(VLOOKUP(J2,'4) INPUT INPS'!$K$4:$L$22,2,FALSE),0)+_xlfn.IFNA(VLOOKUP(J2,'4) INPUT INPS'!$V$4:$AK$14,16,FALSE),0)","v":0},{"$f":"_xlfn.IFNA(VLOOKUP(K2,'4) INPUT INPS'!$K$4:$L$22,2,FALSE),0)+_xlfn.IFNA(VLOOKUP(K2,'4) INPUT INPS'!$V$4:$AK$14,16,FALSE),0)","v":0},{"$f":"_xlfn.IFNA(VLOOKUP(L2,'4) INPUT INPS'!$K$4:$L$22,2,FALSE),0)+_xlfn.IFNA(VLOOKUP(L2,'4) INPUT INPS'!$V$4:$AK$14,16,FALSE),0)","v":0},{"$f":"_xlfn.IFNA(VLOOKUP(M2,'4) INPUT INPS'!$K$4:$L$22,2,FALSE),0)+_xlfn.IFNA(VLOOKUP(M2,'4) INPUT INPS'!$V$4:$AK$14,16,FALSE),0)","v":0},{"$f":"SUM(B3:M3)","v":0},{"$f":"_xlfn.IFNA(VLOOKUP(O2,'4) INPUT INPS'!$K$4:$L$22,2,FALSE),0)+_xlfn.IFNA(VLOOKUP(O2,'4) INPUT INPS'!$V$4:$AK$14,16,FALSE),0)","v":0},{"$f":"_xlfn.IFNA(VLOOKUP(P2,'4) INPUT INPS'!$K$4:$L$22,2,FALSE),0)+_xlfn.IFNA(VLOOKUP(P2,'4) INPUT INPS'!$V$4:$AK$14,16,FALSE),0)","v":0},{"$f":"_xlfn.IFNA(VLOOKUP(Q2,'4) INPUT INPS'!$K$4:$L$22,2,FALSE),0)+_xlfn.IFNA(VLOOKUP(Q2,'4) INPUT INPS'!$V$4:$AK$14,16,FALSE),0)","v":0},{"$f":"_xlfn.IFNA(VLOOKUP(R2,'4) INPUT INPS'!$K$4:$L$22,2,FALSE),0)+_xlfn.IFNA(VLOOKUP(R2,'4) INPUT INPS'!$V$4:$AK$14,16,FALSE),0)","v":0},{"$f":"_xlfn.IFNA(VLOOKUP(S2,'4) INPUT INPS'!$K$4:$L$22,2,FALSE),0)+_xlfn.IFNA(VLOOKUP(S2,'4) INPUT INPS'!$V$4:$AK$14,16,FALSE),0)","v":0},{"$f":"_xlfn.IFNA(VLOOKUP(T2,'4) INPUT INPS'!$K$4:$L$22,2,FALSE),0)+_xlfn.IFNA(VLOOKUP(T2,'4) INPUT INPS'!$V$4:$AK$14,16,FALSE),0)","v":0},{"$f":"_xlfn.IFNA(VLOOKUP(U2,'4) INPUT INPS'!$K$4:$L$22,2,FALSE),0)+_xlfn.IFNA(VLOOKUP(U2,'4) INPUT INPS'!$V$4:$AK$14,16,FALSE),0)","v":0},{"$f":"_xlfn.IFNA(VLOOKUP(V2,'4) INPUT INPS'!$K$4:$L$22,2,FALSE),0)+_xlfn.IFNA(VLOOKUP(V2,'4) INPUT INPS'!$V$4:$AK$14,16,FALSE),0)","v":0},{"$f":"_xlfn.IFNA(VLOOKUP(W2,'4) INPUT INPS'!$K$4:$L$22,2,FALSE),0)+_xlfn.IFNA(VLOOKUP(W2,'4) INPUT INPS'!$V$4:$AK$14,16,FALSE),0)","v":0},{"$f":"_xlfn.IFNA(VLOOKUP(X2,'4) INPUT INPS'!$K$4:$L$22,2,FALSE),0)+_xlfn.IFNA(VLOOKUP(X2,'4) INPUT INPS'!$V$4:$AK$14,16,FALSE),0)","v":0},{"$f":"_xlfn.IFNA(VLOOKUP(Y2,'4) INPUT INPS'!$K$4:$L$22,2,FALSE),0)+_xlfn.IFNA(VLOOKUP(Y2,'4) INPUT INPS'!$V$4:$AK$14,16,FALSE),0)","v":0},{"$f":"_xlfn.IFNA(VLOOKUP(Z2,'4) INPUT INPS'!$K$4:$L$22,2,FALSE),0)+_xlfn.IFNA(VLOOKUP(Z2,'4) INPUT INPS'!$V$4:$AK$14,16,FALSE),0)","v":0},{"$f":"_xlfn.IFNA(VLOOKUP(AA2,'4) INPUT INPS'!$K$4:$L$22,2,FALSE),0)+_xlfn.IFNA(VLOOKUP(AA2,'4) INPUT INPS'!$V$4:$AK$14,16,FALSE),0)","v":0},{"$f":"SUM(O3:AA3)","v":0},{"$f":"_xlfn.IFNA(VLOOKUP(AC2,'4) INPUT INPS'!$K$4:$L$22,2,FALSE),0)+_xlfn.IFNA(VLOOKUP(AC2,'4) INPUT INPS'!$V$4:$AK$14,16,FALSE),0)","v":0},{"$f":"_xlfn.IFNA(VLOOKUP(AD2,'4) INPUT INPS'!$K$4:$L$22,2,FALSE),0)+_xlfn.IFNA(VLOOKUP(AD2,'4) INPUT INPS'!$V$4:$AK$14,16,FALSE),0)","v":0},{"$f":"_xlfn.IFNA(VLOOKUP(AE2,'4) INPUT INPS'!$K$4:$L$22,2,FALSE),0)+_xlfn.IFNA(VLOOKUP(AE2,'4) INPUT INPS'!$V$4:$AK$14,16,FALSE),0)","v":0},{"$f":"_xlfn.IFNA(VLOOKUP(AF2,'4) INPUT INPS'!$K$4:$L$22,2,FALSE),0)+_xlfn.IFNA(VLOOKUP(AF2,'4) INPUT INPS'!$V$4:$AK$14,16,FALSE),0)","v":0},{"$f":"_xlfn.IFNA(VLOOKUP(AG2,'4) INPUT INPS'!$K$4:$L$22,2,FALSE),0)+_xlfn.IFNA(VLOOKUP(AG2,'4) INPUT INPS'!$V$4:$AK$14,16,FALSE),0)","v":0},{"$f":"_xlfn.IFNA(VLOOKUP(AH2,'4) INPUT INPS'!$K$4:$L$22,2,FALSE),0)+_xlfn.IFNA(VLOOKUP(AH2,'4) INPUT INPS'!$V$4:$AK$14,16,FALSE),0)","v":0},{"$f":"_xlfn.IFNA(VLOOKUP(AI2,'4) INPUT INPS'!$K$4:$L$22,2,FALSE),0)+_xlfn.IFNA(VLOOKUP(AI2,'4) INPUT INPS'!$V$4:$AK$14,16,FALSE),0)","v":0},{"$f":"_xlfn.IFNA(VLOOKUP(AJ2,'4) INPUT INPS'!$K$4:$L$22,2,FALSE),0)+_xlfn.IFNA(VLOOKUP(AJ2,'4) INPUT INPS'!$V$4:$AK$14,16,FALSE),0)","v":0},{"$f":"_xlfn.IFNA(VLOOKUP(AK2,'4) INPUT INPS'!$K$4:$L$22,2,FALSE),0)+_xlfn.IFNA(VLOOKUP(AK2,'4) INPUT INPS'!$V$4:$AK$14,16,FALSE),0)","v":0},{"$f":"_xlfn.IFNA(VLOOKUP(AL2,'4) INPUT INPS'!$K$4:$L$22,2,FALSE),0)+_xlfn.IFNA(VLOOKUP(AL2,'4) INPUT INPS'!$V$4:$AK$14,16,FALSE),0)","v":0},{"$f":"_xlfn.IFNA(VLOOKUP(AM2,'4) INPUT INPS'!$K$4:$L$22,2,FALSE),0)+_xlfn.IFNA(VLOOKUP(AM2,'4) INPUT INPS'!$V$4:$AK$14,16,FALSE),0)","v":0},{"$f":"_xlfn.IFNA(VLOOKUP(AN2,'4) INPUT INPS'!$K$4:$L$22,2,FALSE),0)+_xlfn.IFNA(VLOOKUP(AN2,'4) INPUT INPS'!$V$4:$AK$14,16,FALSE),0)","v":0},{"$f":"_xlfn.IFNA(VLOOKUP(AO2,'4) INPUT INPS'!$K$4:$L$22,2,FALSE),0)+_xlfn.IFNA(VLOOKUP(AO2,'4) INPUT INPS'!$V$4:$AK$14,16,FALSE),0)","v":0},{"$f":"SUM(AC3:AO3)","v":0}]
["Imposta di registro",{"$f":"+B5*12*0.02/2","v":0},null,null,null,null,null,null,null,null,null,null,null,{"$f":"SUM(B4:M4)","v":0},null,{"$f":"+B4","v":0},null,null,null,null,null,null,null,null,null,null,null,{"$f":"SUM(P4:AA4)","v":0},null,{"$f":"+P4","v":0},{"$f":"+(1+$AC4)*Q4","v":0},0,0,0,0,0,0,0,0,0,0,{"$f":"SUM(AD4:AO4)","v":0}]
["Affitto",0,{"$f":"+B5","v":0},{"$f":"+C5","v":0},0,0,0,0,0,0,0,0,0,{"$f":"SUM(B5:M5)","v":0},null,{"$f":"+M5","v":0},{"$f":"+P5","v":0},{"$f":"+Q5","v":0},0,0,0,0,0,0,0,0,0,{"$f":"SUM(P5:AA5)","v":0},null,{"$f":"+AA5","v":0},{"$f":"+AD5","v":0},{"$f":"+AE5","v":0},0,0,0,0,0,0,0,0,0,{"$f":"SUM(AD5:AO5)","v":0}]
["Condominio",100,100,100,100,100,100,100,100,100,100,100,100,1200,0,{"$f":"+(1+$O6)*B6","v":100},{"$f":"+(1+$O6)*C6","v":100},{"$f":"+(1+$O6)*D6","v":100},{"$f":"+(1+$O6)*E6","v":100},{"$f":"+(1+$O6)*F6","v":100},{"$f":"+(1+$O6)*G6","v":100},{"$f":"+(1+$O6)*H6","v":100},{"$f":"+(1+$O6)*I6","v":100},{"$f":"+(1+$O6)*J6","v":100},{"$f":"+(1+$O6)*K6","v":100},{"$f":"+(1+$O6)*L6","v":100},{"$f":"+(1+$O6)*M6","v":100},1200,0,{"$f":"+(1+$AC6)*P6","v":100},{"$f":"+(1+$AC6)*Q6","v":100},{"$f":"+(1+$AC6)*R6","v":100},{"$f":"+(1+$AC6)*S6","v":100},{"$f":"+(1+$AC6)*T6","v":100},{"$f":"+(1+$AC6)*U6","v":100},{"$f":"+(1+$AC6)*V6","v":100},{"$f":"+(1+$AC6)*W6","v":100},{"$f":"+(1+$AC6)*X6","v":100},{"$f":"+(1+$AC6)*Y6","v":100},{"$f":"+(1+$AC6)*Z6","v":100},{"$f":"+(1+$AC6)*AA6","v":100},1200]
["Collaboratori occasionali/stagionali",null,null,null,null,null,null,null,null,null,null,null,null,0,0,0,0,0,0,0,0,0,0,0,0,0,0,0,0,0,0,0,0,0,0,0,0,0,0,0,0,0]
["Commercialista, consulente del lavoro, legale",null,null,null,null,null,null,null,null,null,null,null,150,150,0,0,0,0,0,0,0,0,0,0,0,0,150,150,0,0,0,0,0,0,0,0,0,0,0,0,150,150]
["Promozione post avvio",100,100,100,100,100,100,100,100,100,100,100,100,1200,0,100,100,100,100,100,100,100,100,100,100,100,100,1200,0,100,100,100,100,100,100,100,100,100,100,100,100,1200]
["Dominio, hosting e manutenzione sito internet",null,null,null,null,null,null,null,null,null,null,null,100,100,0,0,0,0,0,0,0,0,0,0,0,0,100,100,0,0,0,0,0,0,0,0,0,0,0,0,100,100]
["Noleggio POS",null,null,null,null,null,null,null,null,null,null,null,null,0,0,0,0,0,0,0,0,0,0,0,0,0,0,0,0,0,0,0,0,0,0,0,0,0,0,0,0,0]
["Manutenzioni e riparazioni",null,null,null,null,null,null,null,null,null,null,null,500,500,0,0,0,0,0,0,0,0,0,0,0,0,500,500,0,0,0,0,0,0,0,0,0,0,0,0,500,500]
["Energia elettrica",null,100,null,100,null,100,null,100,null,100,null,100,600,0,0,100,0,100,0,100,0,100,0,100,0,100,600,0,0,100,0,100,0,100,0,100,0,100,0,100,600]
["Spese telefoniche/Internet",30,30,30,30,30,30,30,30,30,30,30,30,360,0,30,30,30,30,30,30,30,30,30,30,30,30,360,0,30,30,30,30,30,30,30,30,30,30,30,30,360]
["Acqua",null,60,null,60,null,60,null,60,null,60,null,60,360,0,0,60,0,60,0,60,0,60,0,60,0,60,360,0,0,60,0,60,0,60,0,60,0,60,0,60,360]
["Metano/gas",null,null,null,null,null,null,null,null,null,null,null,null,0,0,0,0,0,0,0,0,0,0,0,0,0,0,0,0,0,0,0,0,0,0,0,0,0,0,0,0,0]
["Condominio",null,null,null,null,null,null,null,null,null,null,null,null,0,0,0,0,0,0,0,0,0,0,0,0,0,0,0,0,0,0,0,0,0,0,0,0,0,0,0,0,0]
["Marche da bollo",null,null,null,null,null,null,null,null,null,null,null,null,0,0,0,0,0,0,0,0,0,0,0,0,0,0,0,0,0,0,0,0,0,0,0,0,0,0,0,0,0]
["Assicurazioni",150,null,null,null,null,null,null,null,null,null,null,null,150,0,150,0,0,0,0,0,0,0,0,0,0,0,150,0,150,0,0,0,0,0,0,0,0,0,0,0,150]
["Prodotti per la pulizia dei locali",50,null,null,50,null,null,50,null,null,50,null,null,200,0,50,0,0,50,0,0,50,0,0,50,0,0,200,0,50,0,0,50,0,0,50,0,0,50,0,0,200]
["Pulizia",null,null,null,null,null,null,null,null,null,null,null,null,0,0,0,0,0,0,0,0,0,0,0,0,0,0,0,0,0,0,0,0,0,0,0,0,0,0,0,0,0]
["Guardianaggio",null,null,null,null,null,null,null,null,null,null,null,null,0,0,0,0,0,0,0,0,0,0,0,0,0,0,0,0,0,0,0,0,0,0,0,0,0,0,0,0,0]
["Cancelleria",100,null,null,null,null,null,null,null,null,null,null,null,100,0,100,0,0,0,0,0,0,0,0,0,0,0,100,0,100,0,0,0,0,0,0,0,0,0,0,0,100]
["Imposta sui rifiuti",null,null,null,null,null,null,null,null,null,null,null,null,0,0,0,0,0,0,0,0,0,0,0,0,0,0,0,0,0,0,0,0,0,0,0,0,0,0,0,0,0]
["Imu",null,null,null,null,null,null,null,null,null,null,null,null,0,0,0,0,0,0,0,0,0,0,0,0,0,0,0,0,0,0,0,0,0,0,0,0,0,0,0,0,0]
["Tasi",null,null,null,null,null,null,null,null,null,null,null,null,0,0,0,0,0,0,0,0,0,0,0,0,0,0,0,0,0,0,0,0,0,0,0,0,0,0,0,0,0]
["Collaborazioni occasionali (stagionali)",null,null,null,null,null,null,null,null,null,null,null,null,0,0,0,0,0,0,0,0,0,0,0,0,0,0,0,0,0,0,0,0,0,0,0,0,0,0,0,0,0]
["Altri costi fissi",null,null,null,null,null,null,null,null,null,null,null,null,0,0,0,0,0,0,0,0,0,0,0,0,0,0,0,0,0,0,0,0,0,0,0,0,0,0,0,0,0]
["Altri costi fissi",null,null,null,null,null,null,null,null,null,null,null,null,0,0,0,0,0,0,0,0,0,0,0,0,0,0,0,0,0,0,0,0,0,0,0,0,0,0,0,0,0]
["Altri costi fissi",null,null,null,null,null,null,null,null,null,null,null,null,0,0,0,0,0,0,0,0,0,0,0,0,0,0,0,0,0,0,0,0,0,0,0,0,0,0,0,0,0]
["Altri costi fissi",null,null,null,null,null,null,null,null,null,null,null,null,0,0,0,0,0,0,0,0,0,0,0,0,0,0,0,0,0,0,0,0,0,0,0,0,0,0,0,0,0]
["Altri costi fissi",null,null,null,null,null,null,null,null,null,null,null,null,0,0,0,0,0,0,0,0,0,0,0,0,0,0,0,0,0,0,0,0,0,0,0,0,0,0,0,0,0]
["Altri costi fissi",null,null,null,null,null,null,null,null,null,null,null,null,0,0,0,0,0,0,0,0,0,0,0,0,0,0,0,0,0,0,0,0,0,0,0,0,0,0,0,0,0]
["Altri costi fissi",null,null,null,null,null,null,null,null,null,null,null,null,0,0,0,0,0,0,0,0,0,0,0,0,0,0,0,0,0,0,0,0,0,0,0,0,0,0,0,0,0]
["Altri costi fissi",null,null,null,null,null,null,null,null,null,null,null,null,0,0,{"$f":"+(1+$O35)*B35","v":0},{"$f":"+(1+$O35)*C35","v":0},{"$f":"+(1+$O35)*D35","v":0},{"$f":"+(1+$O35)*E35","v":0},{"$f":"+(1+$O35)*F35","v":0},{"$f":"+(1+$O35)*G35","v":0},{"$f":"+(1+$O35)*H35","v":0},{"$f":"+(1+$O35)*I35","v":0},{"$f":"+(1+$O35)*J35","v":0},{"$f":"+(1+$O35)*K35","v":0},{"$f":"+(1+$O35)*L35","v":0},{"$f":"+(1+$O35)*M35","v":0},0,0,{"$f":"+(1+$AC35)*P35","v":0},{"$f":"+(1+$AC35)*Q35","v":0},{"$f":"+(1+$AC35)*R35","v":0},{"$f":"+(1+$AC35)*S35","v":0},{"$f":"+(1+$AC35)*T35","v":0},{"$f":"+(1+$AC35)*U35","v":0},{"$f":"+(1+$AC35)*V35","v":0},{"$f":"+(1+$AC35)*W35","v":0},{"$f":"+(1+$AC35)*X35","v":0},{"$f":"+(1+$AC35)*Y35","v":0},{"$f":"+(1+$AC35)*Z35","v":0},{"$f":"+(1+$AC35)*AA35","v":0},0]
["TOTALE",{"$f":"SUM(B3:B34)","v":530},{"$f":"SUM(C3:C34)","v":390},230,440,230,390,280,390,230,440,230,1140,{"$f":"SUM(N3:N35)","v":4920},null,null,null,null,null,null,null,null,null,null,null,null,"TOTALE",{"$f":"SUM(AB3:AB35)","v":4920},null,null,null,null,null,null,null,null,null,null,null,null,"TOTALE",{"$f":"SUM(AP3:AP35)","v":4920}]

{"sheet":"6) INPUT COSTI VARIABILI","index":5,"n_rows":88,"n_cols":45,"rows_kept":88,"cut":false,"hidden":false,"merged":[[20,31,20,37],[21,36,21,37],[37,31,38,31],[37,32,37,43],[37,15,53,15],[37,30,53,30],[15,32,15,33],[15,35,15,37],[15,38,15,39],[16,32,16,33],[16,35,16,37],[16,38,16,39],[20,16,20,22],[21,21,21,22],[13,32,13,33],[13,35,13,37],[13,38,13,39],[14,32,14,33],[14,35,14,37],[14,38,14,39],[11,32,11,33],[11,35,11,37],[11,38,11,39],[12,32,12,33],[12,35,12,37],[12,38,12,39],[9,32,9,33],[9,35,9,37],[9,38,9,39],[10,32,10,33],[10,35,10,37],[10,38,10,39],[7,32,7,33],[7,35,7,37],[7,38,7,39],[8,32,8,33],[8,35,8,37],[8,38,8,39],[5,32,5,33],[5,35,5,37],[5,38,5,39],[6,32,6,33],[6,35,6,37],[6,38,6,39],[3,32,3,33],[3,35,3,37],[3,38,3,39],[4,32,4,33],[4,35,4,37],[4,38,4,39],[1,32,1,33],[1,35,1,37],[1,38,1,39],[2,32,2,33],[2,35,2,37],[2,38,2,39],[16,17,16,18],[16,20,16,22],[16,23,16,24],[14,17,14,18],[14,20,14,22],[14,23,14,24],[15,17,15,18],[15,20,15,22],[15,23,15,24],[12,17,12,18],[12,20,12,22],[12,23,12,24],[13,17,13,18],[13,20,13,22],[13,23,13,24],[10,17,10,18],[10,20,10,22],[10,23,10,24],[11,17,11,18],[11,20,11,22],[11,23,11,24],[8,17,8,18],[8,20,8,22],[8,23,8,24],[9,17,9,18],[9,20,9,22],[9,23,9,24],[6,23,6,24],[7,17,7,18],[7,20,7,22],[7,23,7,24],[4,20,4,22],[4,23,4,24],[5,17,5,18],[5,20,5,22],[5,23,5,24],[81,32,81,43],[21,6,21,7],[37,16,38,16],[37,17,37,28],[1,8,1,9],[2,8,2,9],[81,2,81,13],[81,17,81,28],[20,1,20,7],[1,17,1,18],[1,20,1,22],[1,23,1,24],[2,17,2,18],[2,20,2,22],[2,23,2,24],[3,17,3,18],[3,20,3,22],[3,23,3,24],[4,17,4,18],[55,1,56,1],[55,17,55,28],[55,32,55,43],[68,1,69,1],[68,17,68,28],[2,5,2,7],[1,5,1,7],[3,5,3,7],[4,5,4,7],[5,5,5,7],[6,5,6,7],[7,5,7,7],[8,5,8,7],[9,5,9,7],[9,8,9,9],[10,8,10,9],[3,8,3,9],[4,8,4,9],[5,8,5,9],[15,5,15,7],[16,5,16,7],[68,32,68,43],[55,2,55,13],[68,2,68,13],[10,5,10,7],[11,5,11,7],[12,5,12,7],[13,5,13,7],[14,5,14,7],[11,8,11,9],[12,8,12,9],[13,8,13,9],[14,8,14,9],[15,8,15,9],[16,8,16,9],[6,8,6,9],[6,17,6,18],[6,20,6,22],[0,2,0,13],[0,17,0,28],[0,32,0,43],[37,2,37,13],[16,2,16,3],[18,9,18,13],[37,1,38,1],[1,2,1,3],[2,2,2,3],[3,2,3,3],[4,2,4,3],[5,2,5,3],[6,2,6,3],[7,2,7,3],[8,2,8,3],[9,2,9,3],[10,2,10,3],[11,2,11,3],[12,2,12,3],[13,2,13,3],[14,2,14,3],[15,2,15,3],[7,8,7,9],[8,8,8,9]]}
[null,"INPUT COSTI VARIABILI"]
[null,"VOCI","COSTO UNITARIO / INCIDENZA %",null,"€ / %","VARIABILI",null,null,"PARAMETRO",null,"TOTALE ANNO 1","check",null,null,null,null,"VOCI","COSTO UNITARIO / INCIDENZA %",null,"€ / %","VARIABILI",null,null,"PARAMETRO",null,"TOTALE ANNO 2","check",null,null,null,null,"VOCI","COSTO UNITARIO / INCIDENZA %",null,"€ / %","VARIABILI",null,null,"PARAMETRO",null,"TOTALE ANNO 2","check"]
[null,"Materie prime colazione",1.5,null,1,"TOTALE CAMERE",null,null,"N. PRESENZE",null,{"$f":"+IF(I3=\"N. PRESENZE\",C3*VLOOKUP(F3,$B$22:$H$33,6,FALSE)/E3,IF(I3=\"FATTURATO\",C3/E3*VLOOKUP(F3,$B$22:$H$33,4,FALSE),IF(I3=\"PRENOTAZIONI\",C3/E3*VLOOKUP(F3,$B$22:$H$33,5,FALSE),0)))","v":1064.3999999999999},{"$f":"+IF(K3=O40,\"ok\",\"errore\")","v":"ok"},null,null,null,null,{"$f":"+B3","v":"Materie prime colazione"},{"$f":"+M21","v":1.5},null,{"$f":"+E3","v":1},{"$f":"+F3","v":"TOTALE CAMERE"},null,null,{"$f":"+I3","v":"N. PRESENZE"},null,{"$f":"+IF(X3=\"N. PRESENZE\",R3*VLOOKUP(U3,$Q$22:$W$33,6,FALSE)/T3,IF(X3=\"FATTURATO\",R3/T3*VLOOKUP(U3,$Q$22:$W$33,4,FALSE),IF(X3=\"PRENOTAZIONI\",R3/T3*VLOOKUP(U3,$Q$22:$W$33,5,FALSE),0)))","v":1064.3999999999999},{"$f":"+IF(Z3=AD40,\"ok\",\"errore\")","v":"ok"},null,null,null,null,{"$f":"+Q3","v":"Materie prime colazione"},{"$f":"+N21","v":1.5},null,{"$f":"+T3","v":1},{"$f":"+U3","v":"TOTALE CAMERE"},null,null,{"$f":"+X3","v":"N. PRESENZE"},null,{"$f":"+IF(AM3=\"N. PRESENZE\",AG3*VLOOKUP(AJ3,$AF$22:$AL$33,6,FALSE)/AI3,IF(AM3=\"FATTURATO\",AG3/AI3*VLOOKUP(AJ3,$AF$22:$AL$33,4,FALSE),IF(AM3=\"PRENOTAZIONI\",AG3/AI3*VLOOKUP(AJ3,$AF$22:$AL$33,5,FALSE),0)))","v":1064.3999999999999},{"$f":"+IF(AO3=AS40,\"ok\",\"errore\")","v":"ok"}]
[null,"Materiale di consumo ospiti",1,null,100,"TOTALE CAMERE",null,null,"FATTURATO",null,278.16000000000003,"ok",null,null,null,null,{"$f":"+B4","v":"Materiale di consumo ospiti"},{"$f":"+M22","v":1},null,{"$f":"+E4","v":100},{"$f":"+F4","v":"TOTALE CAMERE"},null,null,{"$f":"+I4","v":"FATTURATO"},null,{"$f":"+IF(X4=\"N. PRESENZE\",R4*VLOOKUP(U4,$Q$22:$W$33,6,FALSE)/T4,IF(X4=\"FATTURATO\",R4/T4*VLOOKUP(U4,$Q$22:$W$33,4,FALSE),IF(X4=\"PRENOTAZIONI\",R4/T4*VLOOKUP(U4,$Q$22:$W$33,5,FALSE),0)))","v":278.16000000000003},"ok",null,null,null,null,{"$f":"+Q4","v":"Materiale di consumo ospiti"},{"$f":"+N22","v":1},null,{"$f":"+T4","v":100},{"$f":"+U4","v":"TOTALE CAMERE"},null,null,{"$f":"+X4","v":"FATTURATO"},null,{"$f":"+IF(AM4=\"N. PRESENZE\",AG4*VLOOKUP(AJ4,$AF$22:$AL$33,6,FALSE)/AI4,IF(AM4=\"FATTURATO\",AG4/AI4*VLOOKUP(AJ4,$AF$22:$AL$33,4,FALSE),IF(AM4=\"PRENOTAZIONI\",AG4/AI4*VLOOKUP(AJ4,$AF$22:$AL$33,5,FALSE),0)))","v":278.16000000000003},"ok"]
[null,"Materiale di consumo pulizia",1,null,100,"TOTALE CAMERE",null,null,"FATTURATO",null,{"$f":"+IF(I5=\"N. PRESENZE\",C5*VLOOKUP(F5,$B$22:$H$33,6,FALSE)/E5,IF(I5=\"FATTURATO\",C5/E5*VLOOKUP(F5,$B$22:$H$33,4,FALSE),IF(I5=\"PRENOTAZIONI\",C5/E5*VLOOKUP(F5,$B$22:$H$33,5,FALSE),0)))","v":278.16000000000003},"ok",null,null,null,null,"Materiale di consumo pulizia",1,null,100,"TOTALE CAMERE",null,null,"FATTURATO",null,{"$f":"+IF(X5=\"N. PRESENZE\",R5*VLOOKUP(U5,$Q$22:$W$33,6,FALSE)/T5,IF(X5=\"FATTURATO\",R5/T5*VLOOKUP(U5,$Q$22:$W$33,4,FALSE),IF(X5=\"PRENOTAZIONI\",R5/T5*VLOOKUP(U5,$Q$22:$W$33,5,FALSE),0)))","v":278.16000000000003},"ok",null,null,null,null,"Materiale di consumo pulizia",1,null,100,"TOTALE CAMERE",null,null,"FATTURATO",null,278.16000000000003,"ok"]
[null,"Servizi di lavanderia",5,null,100,"TOTALE CAMERE",null,null,"FATTURATO",null,1390.8000000000002,"ok",null,null,null,null,"Servizi di lavanderia",5,null,100,"TOTALE CAMERE",null,null,"FATTURATO",null,{"$f":"+IF(X6=\"N. PRESENZE\",R6*VLOOKUP(U6,$Q$22:$W$33,6,FALSE)/T6,IF(X6=\"FATTURATO\",R6/T6*VLOOKUP(U6,$Q$22:$W$33,4,FALSE),IF(X6=\"PRENOTAZIONI\",R6/T6*VLOOKUP(U6,$Q$22:$W$33,5,FALSE),0)))","v":1390.8000000000002},"ok",null,null,null,null,"Servizi di lavanderia",5,null,100,"TOTALE CAMERE",null,null,"FATTURATO",null,1390.8000000000002,"ok"]
[null,"Visite guidate",0,null,1,"VISITE GUIDATE",null,null,"PRENOTAZIONI",null,0,"ok",null,null,null,null,"Visite guidate",20,null,1,"VISITE GUIDATE",null,null,"PRENOTAZIONI",null,0,"ok",null,null,null,null,"Visite guidate",20,null,1,"VISITE GUIDATE",null,null,"PRENOTAZIONI",null,0,"ok"]
[null,"Altri costi variabili",null,null,null,null,null,null,null,null,0,"ok",null,null,null,null,"Altri costi variabili",0,null,0,0,null,null,0,null,0,"ok",null,null,null,null,"Altri costi variabili",0,null,0,0,null,null,0,null,0,"ok"]
[null,"Altri costi variabili",null,null,null,null,null,null,null,null,0,"ok",null,null,null,null,"Altri costi variabili",0,null,0,0,null,null,0,null,0,"ok",null,null,null,null,"Altri costi variabili",0,null,0,0,null,null,0,null,0,"ok"]
[null,"Altri costi variabili",null,null,null,null,null,null,null,null,0,"ok",null,null,null,null,"Altri costi variabili",0,null,0,0,null,null,0,null,0,"ok",null,null,null,null,"Altri costi variabili",0,null,0,0,null,null,0,null,0,"ok"]
[null,"Altri costi variabili",null,null,null,null,null,null,null,null,0,"ok",null,null,null,null,"Altri costi variabili",0,null,0,0,null,null,0,null,0,"ok",null,null,null,null,"Altri costi variabili",0,null,0,0,null,null,0,null,0,"ok"]
[null,"Altri costi variabili",null,null,null,null,null,null,null,null,0,"ok",null,null,null,null,"Altri costi variabili",0,null,0,0,null,null,0,null,0,"ok",null,null,null,null,"Altri costi variabili",0,null,0,0,null,null,0,null,0,"ok"]
[null,"Altri costi variabili",null,null,null,null,null,null,null,null,0,"ok",null,null,null,null,"Altri costi variabili",0,null,0,0,null,null,0,null,0,"ok",null,null,null,null,"Altri costi variabili",0,null,0,0,null,null,0,null,0,"ok"]
[null,"Altri costi variabili",null,null,null,null,null,null,null,null,0,"ok",null,null,null,null,"Altri costi variabili",0,null,0,0,null,null,0,null,0,"ok",null,null,null,null,"Altri costi variabili",0,null,0,0,null,null,0,null,{"$f":"+IF(AM14=\"N. PRESENZE\",AG14*VLOOKUP(AJ14,$AF$22:$AL$33,6,FALSE)/AI14,IF(AM14=\"FATTURATO\",AG14/AI14*VLOOKUP(AJ14,$AF$22:$AL$33,4,FALSE),IF(AM14=\"PRENOTAZIONI\",AG14/AI14*VLOOKUP(AJ14,$AF$22:$AL$33,5,FALSE),0)))","v":0},"ok"]
[null,"Altri costi variabili",null,null,null,null,null,null,null,null,0,"ok",null,null,null,null,"Altri costi variabili",0,null,0,0,null,null,0,null,0,"ok",null,null,null,null,"Altri costi variabili",0,null,0,0,null,null,0,null,0,"ok"]
[null,"Altri costi variabili",null,null,null,null,null,null,null,null,0,"ok",null,null,null,null,"Altri costi variabili",0,null,0,0,null,null,0,null,0,"ok",null,null,null,null,"Altri costi variabili",0,null,0,0,null,null,0,null,0,"ok"]
[null,"Altri costi variabili",null,null,null,null,null,null,null,null,0,"ok",null,null,null,null,"Altri costi variabili",0,null,0,0,null,null,0,null,0,"ok",null,null,null,null,"Altri costi variabili",0,null,0,0,null,null,0,null,0,"ok"]
[]
[null,null,null,null,null,null,null,null,null,"IPOTESI VARIZIAZIONI COSTI"]
[null,null,null,null,null,null,null,null,null,null,null,"ANNO 1","ANNO 2","ANNO3"]
[null,"VARIABILI",null,null,null,null,null,null,null,{"$f":"+B3","v":"Materie prime colazione"},null,{"$f":"+C3","v":1.5},1.5,{"$f":"+M21","v":1.5},null,null,"VARIABILI",null,null,null,null,null,null,null,null,null,null,null,null,null,null,"VARIABILI"]
[null,"VOCI RICAVI",null,null,"Fatturato","Prenotazioni","N. PRESENZE",null,null,"Materiale di consumo ospiti",null,{"$f":"+C4","v":1},1,{"$f":"+M22","v":1},null,null,"VOCI RICAVI",null,null,"Fatturato","Prenotazioni","N. PRESENZE",null,null,null,null,null,null,null,null,null,"VOCI RICAVI",null,null,"Fatturato","Prenotazioni","N. PRESENZE"]
[null,{"$f":"+'1) INPUT BASE'!B16","v":"CAMERE QUADRUPLE"},null,null,{"$f":"+O58","v":0},{"$f":"+O71","v":0},{"$f":"+F23*4","v":0},null,null,"Materiale di consumo pulizia",null,1,1,{"$f":"+M23","v":1},null,null,{"$f":"+B23","v":"CAMERE QUADRUPLE"},null,null,{"$f":"+AD58","v":0},{"$f":"+AD71","v":0},{"$f":"+U23*4","v":0},null,null,null,null,null,null,null,null,null,{"$f":"+Q23","v":"CAMERE QUADRUPLE"},null,null,{"$f":"+AS58","v":0},{"$f":"+AS71","v":0},{"$f":"+AJ23*4","v":0}]
[null,{"$f":"+'1) INPUT BASE'!B17","v":"CAMERE TRIPLE"},null,null,{"$f":"+O59","v":0},{"$f":"+'3) INPUT VENDITE'!N18","v":0},{"$f":"+F24*3","v":0},null,null,"Servizi di lavanderia",null,5,5,{"$f":"+M24","v":5},null,null,{"$f":"+B24","v":"CAMERE TRIPLE"},null,null,{"$f":"+AD59","v":0},{"$f":"+AD72","v":0},{"$f":"+U24*3","v":0},null,null,null,null,null,null,null,null,null,{"$f":"+Q24","v":"CAMERE TRIPLE"},null,null,{"$f":"+AS59","v":0},{"$f":"+AS72","v":0},{"$f":"+AJ24*3","v":0}]
[null,{"$f":"+'1) INPUT BASE'!B18","v":"CAMERE DOPPIE"},null,null,27816,{"$f":"+'3) INPUT VENDITE'!N19","v":354.79999999999995},{"$f":"+F25*2","v":709.59999999999991},null,null,"Visite guidate",null,0,20,{"$f":"+M25","v":20},null,null,"CAMERE DOPPIE",null,null,27816,354.79999999999995,{"$f":"+U25*2","v":709.59999999999991},null,null,null,null,null,null,null,null,null,"CAMERE DOPPIE",null,null,27816,354.79999999999995,{"$f":"+AJ25*2","v":709.59999999999991}]
[null,{"$f":"+'1) INPUT BASE'!B19","v":"CAMERE SINGOLE"},null,null,0,{"$f":"+'3) INPUT VENDITE'!N20","v":0},{"$f":"+F26*1","v":0},null,null,"Altri costi variabili",null,0,0,{"$f":"+M26","v":0},null,null,"CAMERE SINGOLE",null,null,0,0,{"$f":"+U26*1","v":0},null,null,null,null,null,null,null,null,null,"CAMERE SINGOLE",null,null,0,0,{"$f":"+AJ26*1","v":0}]
[null,{"$f":"+'1) INPUT BASE'!B20","v":"VISITE GUIDATE"},null,null,0,{"$f":"+'3) INPUT VENDITE'!N21","v":0},null,null,null,"Altri costi variabili",null,0,{"$f":"+L27","v":0},0,null,null,"VISITE GUIDATE",null,null,0,0,null,null,null,null,null,null,null,null,null,null,"VISITE GUIDATE",null,null,0,0]
[null,{"$f":"+'1) INPUT BASE'!B21","v":"Altri ricavi"},null,null,0,{"$f":"+'3) INPUT VENDITE'!N22","v":0},null,null,null,"Altri costi variabili",null,0,{"$f":"+L28","v":0},0,null,null,"Altri ricavi",null,null,0,0,null,null,null,null,null,null,null,null,null,null,"Altri ricavi",null,null,0,0]
[null,{"$f":"+'1) INPUT BASE'!B22","v":"Altri ricavi"},null,null,0,{"$f":"+'3) INPUT VENDITE'!N23","v":0},null,null,null,"Altri costi variabili",null,0,{"$f":"+L29","v":0},0,null,null,"Altri ricavi",null,null,0,0,null,null,null,null,null,null,null,null,null,null,"Altri ricavi",null,null,0,0]
[null,{"$f":"+'1) INPUT BASE'!B23","v":"Altri ricavi"},null,null,0,{"$f":"+'3) INPUT VENDITE'!N24","v":0},null,null,null,"Altri costi variabili",null,0,{"$f":"+L30","v":0},0,null,null,"Altri ricavi",null,null,0,0,null,null,null,null,null,null,null,null,null,null,"Altri ricavi",null,null,0,0]
[null,{"$f":"+'1) INPUT BASE'!B24","v":"Altri ricavi"},null,null,0,{"$f":"+'3) INPUT VENDITE'!N25","v":0},null,null,null,"Altri costi variabili",null,0,{"$f":"+L31","v":0},0,null,null,"Altri ricavi",null,null,0,0,null,null,null,null,null,null,null,null,null,null,"Altri ricavi",null,null,0,0]
[null,{"$f":"+'1) INPUT BASE'!B25","v":"Altri ricavi"},null,null,0,{"$f":"+'3) INPUT VENDITE'!N26","v":0},null,null,null,"Altri costi variabili",null,0,{"$f":"+L32","v":0},0,null,null,"Altri ricavi",null,null,0,0,null,null,null,null,null,null,null,null,null,null,"Altri ricavi",null,null,0,0]
[null,"TOTALE CAMERE",null,null,{"$f":"SUM(E23:E26)","v":27816},{"$f":"+'3) INPUT VENDITE'!N27","v":354.79999999999995},{"$f":"SUM(G23:G32)","v":709.59999999999991},null,null,"Altri costi variabili",null,0,{"$f":"+L33","v":0},0,null,null,"TOTALE CAMERE",null,null,{"$f":"SUM(T23:T26)","v":27816},{"$f":"+U23+U24+U25+U26","v":354.79999999999995},{"$f":"SUM(V23:V32)","v":709.59999999999991},null,null,null,null,null,null,null,null,null,"TOTALE CAMERE",null,null,{"$f":"SUM(AI23:AI26)","v":27816},{"$f":"+AJ23+AJ24+AJ25+AJ26","v":354.79999999999995},{"$f":"SUM(AK23:AK32)","v":709.59999999999991}]
[null,null,null,null,null,null,null,null,null,"Altri costi variabili",null,0,{"$f":"+L34","v":0},0]
[null,null,null,null,null,null,null,null,null,"Altri costi variabili",null,0,{"$f":"+L35","v":0},0]
[]
[null,1,2,3,4,5,6,7,8,9,10,11,12,13,null,null,1,2,3,4,5,6,7,8,9,10,11,12,13,null,null,1,2,3,4,5,6,7,8,9,10,11,12,13]
[null,"PIANO DEI COSTI VARIABILI","MESI",null,null,null,null,null,null,null,null,null,null,null,"ANNO 1",null,"PIANO DEI COSTI VARIABILI","MESI",null,null,null,null,null,null,null,null,null,null,null,"ANNO 2",null,"PIANO DEI COSTI VARIABILI","MESI",null,null,null,null,null,null,null,null,null,null,null,"ANNO3"]
[null,null,{"$f":"+'5) INPUT COSTI FISSI'!B2","v":"2016-04-30"},{"$f":"+EOMONTH(C39,1)","v":"2016-05-31"},{"$f":"+EOMONTH(D39,1)","v":"2016-06-30"},"2016-07-31","2016-08-31","2016-09-30","2016-10-31","2016-11-30","2016-12-31",{"$f":"+EOMONTH(K39,1)","v":"2017-01-31"},"2017-02-28","2017-03-31","TOTALE",null,null,{"$f":"+R57","v":"2017-04-30"},{"$f":"+EOMONTH(R39,1)","v":"2017-05-31"},{"$f":"+EOMONTH(S39,1)","v":"2017-06-30"},{"$f":"+EOMONTH(T39,1)","v":"2017-07-31"},{"$f":"+EOMONTH(U39,1)","v":"2017-08-31"},{"$f":"+EOMONTH(V39,1)","v":"2017-09-30"},{"$f":"+EOMONTH(W39,1)","v":"2017-10-31"},{"$f":"+EOMONTH(X39,1)","v":"2017-11-30"},{"$f":"+EOMONTH(Y39,1)","v":"2017-12-31"},{"$f":"+EOMONTH(Z39,1)","v":"2018-01-31"},{"$f":"+EOMONTH(AA39,1)","v":"2018-02-28"},{"$f":"+EOMONTH(AB39,1)","v":"2018-03-31"},"TOTALE",null,null,{"$f":"+AG57","v":"2018-04-30"},{"$f":"+EOMONTH(AG39,1)","v":"2018-05-31"},{"$f":"+EOMONTH(AH39,1)","v":"2018-06-30"},{"$f":"+EOMONTH(AI39,1)","v":"2018-07-31"},{"$f":"+EOMONTH(AJ39,1)","v":"2018-08-31"},{"$f":"+EOMONTH(AK39,1)","v":"2018-09-30"},{"$f":"+EOMONTH(AL39,1)","v":"2018-10-31"},{"$f":"+EOMONTH(AM39,1)","v":"2018-11-30"},{"$f":"+EOMONTH(AN39,1)","v":"2018-12-31"},{"$f":"+EOMONTH(AO39,1)","v":"2019-01-31"},{"$f":"+EOMONTH(AP39,1)","v":"2019-02-28"},{"$f":"+EOMONTH(AQ39,1)","v":"2019-03-31"},"TOTALE"]
[null,{"$f":"+B3","v":"Materie prime colazione"},{"$f":"+IF($I3=\"N. PRESENZE\",$C3*VLOOKUP($F3,$B$83:$O$88,$C$37,FALSE)/$E3,IF($I3=\"FATTURATO\",$C3/$E3*VLOOKUP($F3,$B$58:$N$68,$C$37,FALSE),IF($I3=\"PRENOTAZIONI\",$C3/$E3*VLOOKUP($F3,$B$71:$N$81,$C$37,FALSE),0)))","v":36},{"$f":"+IF($I3=\"N. PRESENZE\",$C3*VLOOKUP($F3,$B$83:$O$88,$D$37,FALSE)/$E3,IF($I3=\"FATTURATO\",$C3/$E3*VLOOKUP($F3,$B$58:$N$68,$D$37,FALSE),IF($I3=\"PRENOTAZIONI\",$C3/$E3*VLOOKUP($F3,$B$71:$N$81,$D$37,FALSE),0)))","v":93},{"$f":"+IF($I3=\"N. PRESENZE\",$C3*VLOOKUP($F3,$B$83:$O$88,$E$37,FALSE)/$E3,IF($I3=\"FATTURATO\",$C3/$E3*VLOOKUP($F3,$B$58:$N$68,$E$37,FALSE),IF($I3=\"PRENOTAZIONI\",$C3/$E3*VLOOKUP($F3,$B$71:$N$81,$E$37,FALSE),0)))","v":162},{"$f":"+IF($I3=\"N. PRESENZE\",$C3*VLOOKUP($F3,$B$83:$O$88,$F$37,FALSE)/$E3,IF($I3=\"FATTURATO\",$C3/$E3*VLOOKUP($F3,$B$58:$N$68,$F$37,FALSE),IF($I3=\"PRENOTAZIONI\",$C3/$E3*VLOOKUP($F3,$B$71:$N$81,$F$37,FALSE),0)))","v":167.4},{"$f":"+IF($I3=\"N. PRESENZE\",$C3*VLOOKUP($F3,$B$83:$O$88,$G$37,FALSE)/$E3,IF($I3=\"FATTURATO\",$C3/$E3*VLOOKUP($F3,$B$58:$N$68,$G$37,FALSE),IF($I3=\"PRENOTAZIONI\",$C3/$E3*VLOOKUP($F3,$B$71:$N$81,$G$37,FALSE),0)))","v":167.4},{"$f":"+IF($I3=\"N. PRESENZE\",$C3*VLOOKUP($F3,$B$83:$O$88,$H$37,FALSE)/$E3,IF($I3=\"FATTURATO\",$C3/$E3*VLOOKUP($F3,$B$58:$N$68,$H$37,FALSE),IF($I3=\"PRENOTAZIONI\",$C3/$E3*VLOOKUP($F3,$B$71:$N$81,$H$37,FALSE),0)))","v":90},{"$f":"+IF($I3=\"N. PRESENZE\",$C3*VLOOKUP($F3,$B$83:$O$88,$I$37,FALSE)/$E3,IF($I3=\"FATTURATO\",$C3/$E3*VLOOKUP($F3,$B$58:$N$68,$I$37,FALSE),IF($I3=\"PRENOTAZIONI\",$C3/$E3*VLOOKUP($F3,$B$71:$N$81,$I$37,FALSE),0)))","v":37.200000000000003},{"$f":"+IF($I3=\"N. PRESENZE\",$C3*VLOOKUP($F3,$B$83:$O$88,$J$37,FALSE)/$E3,IF($I3=\"FATTURATO\",$C3/$E3*VLOOKUP($F3,$B$58:$N$68,$J$37,FALSE),IF($I3=\"PRENOTAZIONI\",$C3/$E3*VLOOKUP($F3,$B$71:$N$81,$J$37,FALSE),0)))","v":36},{"$f":"+IF($I3=\"N. PRESENZE\",$C3*VLOOKUP($F3,$B$83:$O$88,$K$37,FALSE)/$E3,IF($I3=\"FATTURATO\",$C3/$E3*VLOOKUP($F3,$B$58:$N$68,$K$37,FALSE),IF($I3=\"PRENOTAZIONI\",$C3/$E3*VLOOKUP($F3,$B$71:$N$81,$K$37,FALSE),0)))","v":167.4},{"$f":"+IF($I3=\"N. PRESENZE\",$C3*VLOOKUP($F3,$B$83:$O$88,$L$37,FALSE)/$E3,IF($I3=\"FATTURATO\",$C3/$E3*VLOOKUP($F3,$B$58:$N$68,$L$37,FALSE),IF($I3=\"PRENOTAZIONI\",$C3/$E3*VLOOKUP($F3,$B$71:$N$81,$L$37,FALSE),0)))","v":37.200000000000003},{"$f":"+IF($I3=\"N. PRESENZE\",$C3*VLOOKUP($F3,$B$83:$O$88,$M$37,FALSE)/$E3,IF($I3=\"FATTURATO\",$C3/$E3*VLOOKUP($F3,$B$58:$N$68,$M$37,FALSE),IF($I3=\"PRENOTAZIONI\",$C3/$E3*VLOOKUP($F3,$B$71:$N$81,$M$37,FALSE),0)))","v":33.6},{"$f":"+IF($I3=\"N. PRESENZE\",$C3*VLOOKUP($F3,$B$83:$O$88,$N$37,FALSE)/$E3,IF($I3=\"FATTURATO\",$C3/$E3*VLOOKUP($F3,$B$58:$N$68,$N$37,FALSE),IF($I3=\"PRENOTAZIONI\",$C3/$E3*VLOOKUP($F3,$B$71:$N$81,$N$37,FALSE),0)))","v":37.200000000000003},{"$f":"SUM(C40:N40)","v":1064.4000000000001},null,{"$f":"+Q3","v":"Materie prime colazione"},{"$f":"+IF($X3=\"N. PRESENZE\",$R3*VLOOKUP($U3,$Q$83:$AD$88,$C$37,FALSE)/$T3,IF($X3=\"FATTURATO\",$R3/$T3*VLOOKUP($U3,$Q$58:$AC$68,$C$37,FALSE),IF($X3=\"PRENOTAZIONI\",$R3/$T3*VLOOKUP($U3,$Q$71:$AC$81,$C$37,FALSE),0)))","v":36},{"$f":"+IF($X3=\"N. PRESENZE\",$R3*VLOOKUP($U3,$Q$83:$AD$88,$D$37,FALSE)/$T3,IF($X3=\"FATTURATO\",$R3/$T3*VLOOKUP($U3,$Q$58:$AC$68,$D$37,FALSE),IF($X3=\"PRENOTAZIONI\",$R3/$T3*VLOOKUP($U3,$Q$71:$AC$81,$D$37,FALSE),0)))","v":93},{"$f":"+IF($X3=\"N. PRESENZE\",$R3*VLOOKUP($U3,$Q$83:$AD$88,$E$37,FALSE)/$T3,IF($X3=\"FATTURATO\",$R3/$T3*VLOOKUP($U3,$Q$58:$AC$68,$E$37,FALSE),IF($X3=\"PRENOTAZIONI\",$R3/$T3*VLOOKUP($U3,$Q$71:$AC$81,$E$37,FALSE),0)))","v":162},{"$f":"+IF($X3=\"N. PRESENZE\",$R3*VLOOKUP($U3,$Q$83:$AD$88,$F$37,FALSE)/$T3,IF($X3=\"FATTURATO\",$R3/$T3*VLOOKUP($U3,$Q$58:$AC$68,$F$37,FALSE),IF($X3=\"PRENOTAZIONI\",$R3/$T3*VLOOKUP($U3,$Q$71:$AC$81,$F$37,FALSE),0)))","v":167.4},{"$f":"+IF($X3=\"N. PRESENZE\",$R3*VLOOKUP($U3,$Q$83:$AD$88,$G$37,FALSE)/$T3,IF($X3=\"FATTURATO\",$R3/$T3*VLOOKUP($U3,$Q$58:$AC$68,$G$37,FALSE),IF($X3=\"PRENOTAZIONI\",$R3/$T3*VLOOKUP($U3,$Q$71:$AC$81,$G$37,FALSE),0)))","v":167.4},{"$f":"+IF($X3=\"N. PRESENZE\",$R3*VLOOKUP($U3,$Q$83:$AD$88,$H$37,FALSE)/$T3,IF($X3=\"FATTURATO\",$R3/$T3*VLOOKUP($U3,$Q$58:$AC$68,$H$37,FALSE),IF($X3=\"PRENOTAZIONI\",$R3/$T3*VLOOKUP($U3,$Q$71:$AC$81,$H$37,FALSE),0)))","v":90},{"$f":"+IF($X3=\"N. PRESENZE\",$R3*VLOOKUP($U3,$Q$83:$AD$88,$I$37,FALSE)/$T3,IF($X3=\"FATTURATO\",$R3/$T3*VLOOKUP($U3,$Q$58:$AC$68,$I$37,FALSE),IF($X3=\"PRENOTAZIONI\",$R3/$T3*VLOOKUP($U3,$Q$71:$AC$81,$I$37,FALSE),0)))","v":37.200000000000003},{"$f":"+IF($X3=\"N. PRESENZE\",$R3*VLOOKUP($U3,$Q$83:$AD$88,$J$37,FALSE)/$T3,IF($X3=\"FATTURATO\",$R3/$T3*VLOOKUP($U3,$Q$58:$AC$68,$J$37,FALSE),IF($X3=\"PRENOTAZIONI\",$R3/$T3*VLOOKUP($U3,$Q$71:$AC$81,$J$37,FALSE),0)))","v":36},{"$f":"+IF($X3=\"N. PRESENZE\",$R3*VLOOKUP($U3,$Q$83:$AD$88,$K$37,FALSE)/$T3,IF($X3=\"FATTURATO\",$R3/$T3*VLOOKUP($U3,$Q$58:$AC$68,$K$37,FALSE),IF($X3=\"PRENOTAZIONI\",$R3/$T3*VLOOKUP($U3,$Q$71:$AC$81,$K$37,FALSE),0)))","v":167.4},{"$f":"+IF($X3=\"N. PRESENZE\",$R3*VLOOKUP($U3,$Q$83:$AD$88,$L$37,FALSE)/$T3,IF($X3=\"FATTURATO\",$R3/$T3*VLOOKUP($U3,$Q$58:$AC$68,$L$37,FALSE),IF($X3=\"PRENOTAZIONI\",$R3/$T3*VLOOKUP($U3,$Q$71:$AC$81,$L$37,FALSE),0)))","v":37.200000000000003},{"$f":"+IF($X3=\"N. PRESENZE\",$R3*VLOOKUP($U3,$Q$83:$AD$88,$M$37,FALSE)/$T3,IF($X3=\"FATTURATO\",$R3/$T3*VLOOKUP($U3,$Q$58:$AC$68,$M$37,FALSE),IF($X3=\"PRENOTAZIONI\",$R3/$T3*VLOOKUP($U3,$Q$71:$AC$81,$M$37,FALSE),0)))","v":33.6},{"$f":"+IF($X3=\"N. PRESENZE\",$R3*VLOOKUP($U3,$Q$83:$AD$88,$N$37,FALSE)/$T3,IF($X3=\"FATTURATO\",$R3/$T3*VLOOKUP($U3,$Q$58:$AC$68,$N$37,FALSE),IF($X3=\"PRENOTAZIONI\",$R3/$T3*VLOOKUP($U3,$Q$71:$AC$81,$N$37,FALSE),0)))","v":37.200000000000003},{"$f":"SUM(R40:AC40)","v":1064.4000000000001},null,{"$f":"+AF3","v":"Materie prime colazione"},{"$f":"+IF($AM3=\"N. PRESENZE\",$AG3*VLOOKUP($AJ3,$AF$84:$AS$89,$C$37,FALSE)/$AI3,IF($AM3=\"FATTURATO\",$AG3/$AI3*VLOOKUP($AJ3,$AF$58:$AR$68,$C$37,FALSE),IF($AM3=\"PRENOTAZIONI\",$AG3/$AI3*VLOOKUP($AJ3,$AF$71:$AR$81,$C$37,FALSE),0)))","v":36},{"$f":"+IF($AM3=\"N. PRESENZE\",$AG3*VLOOKUP($AJ3,$AF$83:$AS$88,$D$37,FALSE)/$AI3,IF($AM3=\"FATTURATO\",$AG3/$AI3*VLOOKUP($AJ3,$AF$58:$AR$68,$D$37,FALSE),IF($AM3=\"PRENOTAZIONI\",$AG3/$AI3*VLOOKUP($AJ3,$AF$71:$AR$81,$D$37,FALSE),0)))","v":93},{"$f":"+IF($AM3=\"N. PRESENZE\",$AG3*VLOOKUP($AJ3,$AF$83:$AS$88,$E$37,FALSE)/$AI3,IF($AM3=\"FATTURATO\",$AG3/$AI3*VLOOKUP($AJ3,$AF$58:$AR$68,$E$37,FALSE),IF($AM3=\"PRENOTAZIONI\",$AG3/$AI3*VLOOKUP($AJ3,$AF$71:$AR$81,$E$37,FALSE),0)))","v":162},{"$f":"+IF($AM3=\"N. PRESENZE\",$AG3*VLOOKUP($AJ3,$AF$84:$AS$89,$F$37,FALSE)/$AI3,IF($AM3=\"FATTURATO\",$AG3/$AI3*VLOOKUP($AJ3,$AF$58:$AR$68,$F$37,FALSE),IF($AM3=\"PRENOTAZIONI\",$AG3/$AI3*VLOOKUP($AJ3,$AF$71:$AR$81,$F$37,FALSE),0)))","v":167.4},{"$f":"+IF($AM3=\"N. PRESENZE\",$AG3*VLOOKUP($AJ3,$AF$84:$AS$89,$G$37,FALSE)/$AI3,IF($AM3=\"FATTURATO\",$AG3/$AI3*VLOOKUP($AJ3,$AF$58:$AR$68,$G$37,FALSE),IF($AM3=\"PRENOTAZIONI\",$AG3/$AI3*VLOOKUP($AJ3,$AF$71:$AR$81,$G$37,FALSE),0)))","v":167.4},{"$f":"+IF($AM3=\"N. PRESENZE\",$AG3*VLOOKUP($AJ3,$AF$84:$AS$89,$H$37,FALSE)/$AI3,IF($AM3=\"FATTURATO\",$AG3/$AI3*VLOOKUP($AJ3,$AF$58:$AR$68,$H$37,FALSE),IF($AM3=\"PRENOTAZIONI\",$AG3/$AI3*VLOOKUP($AJ3,$AF$71:$AR$81,$H$37,FALSE),0)))","v":90},{"$f":"+IF($AM3=\"N. PRESENZE\",$AG3*VLOOKUP($AJ3,$AF$83:$AS$88,$I$37,FALSE)/$AI3,IF($AM3=\"FATTURATO\",$AG3/$AI3*VLOOKUP($AJ3,$AF$58:$AR$68,$I$37,FALSE),IF($AM3=\"PRENOTAZIONI\",$AG3/$AI3*VLOOKUP($AJ3,$AF$71:$AR$81,$I$37,FALSE),0)))","v":37.200000000000003},{"$f":"+IF($AM3=\"N. PRESENZE\",$AG3*VLOOKUP($AJ3,$AF$83:$AS$88,$J$37,FALSE)/$AI3,IF($AM3=\"FATTURATO\",$AG3/$AI3*VLOOKUP($AJ3,$AF$58:$AR$68,$J$37,FALSE),IF($AM3=\"PRENOTAZIONI\",$AG3/$AI3*VLOOKUP($AJ3,$AF$71:$AR$81,$J$37,FALSE),0)))","v":36},{"$f":"+IF($AM3=\"N. PRESENZE\",$AG3*VLOOKUP($AJ3,$AF$83:$AS$88,$K$37,FALSE)/$AI3,IF($AM3=\"FATTURATO\",$AG3/$AI3*VLOOKUP($AJ3,$AF$58:$AR$68,$K$37,FALSE),IF($AM3=\"PRENOTAZIONI\",$AG3/$AI3*VLOOKUP($AJ3,$AF$71:$AR$81,$K$37,FALSE),0)))","v":167.4},{"$f":"+IF($AM3=\"N. PRESENZE\",$AG3*VLOOKUP($AJ3,$AF$83:$AS$88,$L$37,FALSE)/$AI3,IF($AM3=\"FATTURATO\",$AG3/$AI3*VLOOKUP($AJ3,$AF$58:$AR$68,$L$37,FALSE),IF($AM3=\"PRENOTAZIONI\",$AG3/$AI3*VLOOKUP($AJ3,$AF$71:$AR$81,$L$37,FALSE),0)))","v":37.200000000000003},{"$f":"+IF($AM3=\"N. PRESENZE\",$AG3*VLOOKUP($AJ3,$AF$84:$AS$89,$M$37,FALSE)/$AI3,IF($AM3=\"FATTURATO\",$AG3/$AI3*VLOOKUP($AJ3,$AF$58:$AR$68,$M$37,FALSE),IF($AM3=\"PRENOTAZIONI\",$AG3/$AI3*VLOOKUP($AJ3,$AF$71:$AR$81,$M$37,FALSE),0)))","v":33.6},{"$f":"+IF($AM3=\"N. PRESENZE\",$AG3*VLOOKUP($AJ3,$AF$84:$AS$89,$N$37,FALSE)/$AI3,IF($AM3=\"FATTURATO\",$AG3/$AI3*VLOOKUP($AJ3,$AF$58:$AR$68,$N$37,FALSE),IF($AM3=\"PRENOTAZIONI\",$AG3/$AI3*VLOOKUP($AJ3,$AF$71:$AR$81,$N$37,FALSE),0)))","v":37.200000000000003},{"$f":"SUM(AG40:AR40)","v":1064.4000000000001}]
[null,"Materiale di consumo ospiti",6,21.7,48.6,50.22,50.22,21,6.2,6,50.22,6.2,5.6000000000000005,6.2,278.15999999999997,null,"Materiale di consumo ospiti",{"$f":"+IF($X4=\"N. PRESENZE\",$R4*VLOOKUP($U4,$Q$83:$AD$88,$C$37,FALSE)/$T4,IF($X4=\"FATTURATO\",$R4/$T4*VLOOKUP($U4,$Q$58:$AC$68,$C$37,FALSE),IF($X4=\"PRENOTAZIONI\",$R4/$T4*VLOOKUP($U4,$Q$71:$AC$81,$C$37,FALSE),0)))","v":6},{"$f":"+IF($X4=\"N. PRESENZE\",$R4*VLOOKUP($U4,$Q$83:$AD$88,$D$37,FALSE)/$T4,IF($X4=\"FATTURATO\",$R4/$T4*VLOOKUP($U4,$Q$58:$AC$68,$D$37,FALSE),IF($X4=\"PRENOTAZIONI\",$R4/$T4*VLOOKUP($U4,$Q$71:$AC$81,$D$37,FALSE),0)))","v":21.7},{"$f":"+IF($X4=\"N. PRESENZE\",$R4*VLOOKUP($U4,$Q$83:$AD$88,$E$37,FALSE)/$T4,IF($X4=\"FATTURATO\",$R4/$T4*VLOOKUP($U4,$Q$58:$AC$68,$E$37,FALSE),IF($X4=\"PRENOTAZIONI\",$R4/$T4*VLOOKUP($U4,$Q$71:$AC$81,$E$37,FALSE),0)))","v":48.6},{"$f":"+IF($X4=\"N. PRESENZE\",$R4*VLOOKUP($U4,$Q$83:$AD$88,$F$37,FALSE)/$T4,IF($X4=\"FATTURATO\",$R4/$T4*VLOOKUP($U4,$Q$58:$AC$68,$F$37,FALSE),IF($X4=\"PRENOTAZIONI\",$R4/$T4*VLOOKUP($U4,$Q$71:$AC$81,$F$37,FALSE),0)))","v":50.22},{"$f":"+IF($X4=\"N. PRESENZE\",$R4*VLOOKUP($U4,$Q$83:$AD$88,$G$37,FALSE)/$T4,IF($X4=\"FATTURATO\",$R4/$T4*VLOOKUP($U4,$Q$58:$AC$68,$G$37,FALSE),IF($X4=\"PRENOTAZIONI\",$R4/$T4*VLOOKUP($U4,$Q$71:$AC$81,$G$37,FALSE),0)))","v":50.22},{"$f":"+IF($X4=\"N. PRESENZE\",$R4*VLOOKUP($U4,$Q$83:$AD$88,$H$37,FALSE)/$T4,IF($X4=\"FATTURATO\",$R4/$T4*VLOOKUP($U4,$Q$58:$AC$68,$H$37,FALSE),IF($X4=\"PRENOTAZIONI\",$R4/$T4*VLOOKUP($U4,$Q$71:$AC$81,$H$37,FALSE),0)))","v":21},{"$f":"+IF($X4=\"N. PRESENZE\",$R4*VLOOKUP($U4,$Q$83:$AD$88,$I$37,FALSE)/$T4,IF($X4=\"FATTURATO\",$R4/$T4*VLOOKUP($U4,$Q$58:$AC$68,$I$37,FALSE),IF($X4=\"PRENOTAZIONI\",$R4/$T4*VLOOKUP($U4,$Q$71:$AC$81,$I$37,FALSE),0)))","v":6.2},{"$f":"+IF($X4=\"N. PRESENZE\",$R4*VLOOKUP($U4,$Q$83:$AD$88,$J$37,FALSE)/$T4,IF($X4=\"FATTURATO\",$R4/$T4*VLOOKUP($U4,$Q$58:$AC$68,$J$37,FALSE),IF($X4=\"PRENOTAZIONI\",$R4/$T4*VLOOKUP($U4,$Q$71:$AC$81,$J$37,FALSE),0)))","v":6},{"$f":"+IF($X4=\"N. PRESENZE\",$R4*VLOOKUP($U4,$Q$83:$AD$88,$K$37,FALSE)/$T4,IF($X4=\"FATTURATO\",$R4/$T4*VLOOKUP($U4,$Q$58:$AC$68,$K$37,FALSE),IF($X4=\"PRENOTAZIONI\",$R4/$T4*VLOOKUP($U4,$Q$71:$AC$81,$K$37,FALSE),0)))","v":50.22},{"$f":"+IF($X4=\"N. PRESENZE\",$R4*VLOOKUP($U4,$Q$83:$AD$88,$L$37,FALSE)/$T4,IF($X4=\"FATTURATO\",$R4/$T4*VLOOKUP($U4,$Q$58:$AC$68,$L$37,FALSE),IF($X4=\"PRENOTAZIONI\",$R4/$T4*VLOOKUP($U4,$Q$71:$AC$81,$L$37,FALSE),0)))","v":6.2},{"$f":"+IF($X4=\"N. PRESENZE\",$R4*VLOOKUP($U4,$Q$83:$AD$88,$M$37,FALSE)/$T4,IF($X4=\"FATTURATO\",$R4/$T4*VLOOKUP($U4,$Q$58:$AC$68,$M$37,FALSE),IF($X4=\"PRENOTAZIONI\",$R4/$T4*VLOOKUP($U4,$Q$71:$AC$81,$M$37,FALSE),0)))","v":5.6000000000000005},{"$f":"+IF($X4=\"N. PRESENZE\",$R4*VLOOKUP($U4,$Q$83:$AD$88,$N$37,FALSE)/$T4,IF($X4=\"FATTURATO\",$R4/$T4*VLOOKUP($U4,$Q$58:$AC$68,$N$37,FALSE),IF($X4=\"PRENOTAZIONI\",$R4/$T4*VLOOKUP($U4,$Q$71:$AC$81,$N$37,FALSE),0)))","v":6.2},278.15999999999997,null,"Materiale di consumo ospiti",{"$f":"+IF($AM4=\"N. PRESENZE\",$AG4*VLOOKUP($AJ4,$AF$84:$AS$89,$C$37,FALSE)/$AI4,IF($AM4=\"FATTURATO\",$AG4/$AI4*VLOOKUP($AJ4,$AF$58:$AR$68,$C$37,FALSE),IF($AM4=\"PRENOTAZIONI\",$AG4/$AI4*VLOOKUP($AJ4,$AF$71:$AR$81,$C$37,FALSE),0)))","v":6},{"$f":"+IF($AM4=\"N. PRESENZE\",$AG4*VLOOKUP($AJ4,$AF$83:$AS$88,$D$37,FALSE)/$AI4,IF($AM4=\"FATTURATO\",$AG4/$AI4*VLOOKUP($AJ4,$AF$58:$AR$68,$D$37,FALSE),IF($AM4=\"PRENOTAZIONI\",$AG4/$AI4*VLOOKUP($AJ4,$AF$71:$AR$81,$D$37,FALSE),0)))","v":21.7},{"$f":"+IF($AM4=\"N. PRESENZE\",$AG4*VLOOKUP($AJ4,$AF$83:$AS$88,$E$37,FALSE)/$AI4,IF($AM4=\"FATTURATO\",$AG4/$AI4*VLOOKUP($AJ4,$AF$58:$AR$68,$E$37,FALSE),IF($AM4=\"PRENOTAZIONI\",$AG4/$AI4*VLOOKUP($AJ4,$AF$71:$AR$81,$E$37,FALSE),0)))","v":48.6},{"$f":"+IF($AM4=\"N. PRESENZE\",$AG4*VLOOKUP($AJ4,$AF$84:$AS$89,$F$37,FALSE)/$AI4,IF($AM4=\"FATTURATO\",$AG4/$AI4*VLOOKUP($AJ4,$AF$58:$AR$68,$F$37,FALSE),IF($AM4=\"PRENOTAZIONI\",$AG4/$AI4*VLOOKUP($AJ4,$AF$71:$AR$81,$F$37,FALSE),0)))","v":50.22},{"$f":"+IF($AM4=\"N. PRESENZE\",$AG4*VLOOKUP($AJ4,$AF$84:$AS$89,$G$37,FALSE)/$AI4,IF($AM4=\"FATTURATO\",$AG4/$AI4*VLOOKUP($AJ4,$AF$58:$AR$68,$G$37,FALSE),IF($AM4=\"PRENOTAZIONI\",$AG4/$AI4*VLOOKUP($AJ4,$AF$71:$AR$81,$G$37,FALSE),0)))","v":50.22},{"$f":"+IF($AM4=\"N. PRESENZE\",$AG4*VLOOKUP($AJ4,$AF$84:$AS$89,$H$37,FALSE)/$AI4,IF($AM4=\"FATTURATO\",$AG4/$AI4*VLOOKUP($AJ4,$AF$58:$AR$68,$H$37,FALSE),IF($AM4=\"PRENOTAZIONI\",$AG4/$AI4*VLOOKUP($AJ4,$AF$71:$AR$81,$H$37,FALSE),0)))","v":21},{"$f":"+IF($AM4=\"N. PRESENZE\",$AG4*VLOOKUP($AJ4,$AF$83:$AS$88,$I$37,FALSE)/$AI4,IF($AM4=\"FATTURATO\",$AG4/$AI4*VLOOKUP($AJ4,$AF$58:$AR$68,$I$37,FALSE),IF($AM4=\"PRENOTAZIONI\",$AG4/$AI4*VLOOKUP($AJ4,$AF$71:$AR$81,$I$37,FALSE),0)))","v":6.2},{"$f":"+IF($AM4=\"N. PRESENZE\",$AG4*VLOOKUP($AJ4,$AF$83:$AS$88,$J$37,FALSE)/$AI4,IF($AM4=\"FATTURATO\",$AG4/$AI4*VLOOKUP($AJ4,$AF$58:$AR$68,$J$37,FALSE),IF($AM4=\"PRENOTAZIONI\",$AG4/$AI4*VLOOKUP($AJ4,$AF$71:$AR$81,$J$37,FALSE),0)))","v":6},{"$f":"+IF($AM4=\"N. PRESENZE\",$AG4*VLOOKUP($AJ4,$AF$83:$AS$88,$K$37,FALSE)/$AI4,IF($AM4=\"FATTURATO\",$AG4/$AI4*VLOOKUP($AJ4,$AF$58:$AR$68,$K$37,FALSE),IF($AM4=\"PRENOTAZIONI\",$AG4/$AI4*VLOOKUP($AJ4,$AF$71:$AR$81,$K$37,FALSE),0)))","v":50.22},{"$f":"+IF($AM4=\"N. PRESENZE\",$AG4*VLOOKUP($AJ4,$AF$83:$AS$88,$L$37,FALSE)/$AI4,IF($AM4=\"FATTURATO\",$AG4/$AI4*VLOOKUP($AJ4,$AF$58:$AR$68,$L$37,FALSE),IF($AM4=\"PRENOTAZIONI\",$AG4/$AI4*VLOOKUP($AJ4,$AF$71:$AR$81,$L$37,FALSE),0)))","v":6.2},{"$f":"+IF($AM4=\"N. PRESENZE\",$AG4*VLOOKUP($AJ4,$AF$84:$AS$89,$M$37,FALSE)/$AI4,IF($AM4=\"FATTURATO\",$AG4/$AI4*VLOOKUP($AJ4,$AF$58:$AR$68,$M$37,FALSE),IF($AM4=\"PRENOTAZIONI\",$AG4/$AI4*VLOOKUP($AJ4,$AF$71:$AR$81,$M$37,FALSE),0)))","v":5.6000000000000005},{"$f":"+IF($AM4=\"N. PRESENZE\",$AG4*VLOOKUP($AJ4,$AF$84:$AS$89,$N$37,FALSE)/$AI4,IF($AM4=\"FATTURATO\",$AG4/$AI4*VLOOKUP($AJ4,$AF$58:$AR$68,$N$37,FALSE),IF($AM4=\"PRENOTAZIONI\",$AG4/$AI4*VLOOKUP($AJ4,$AF$71:$AR$81,$N$37,FALSE),0)))","v":6.2},278.15999999999997]
[null,"Materiale di consumo pulizia",6,21.7,48.6,50.22,50.22,21,6.2,6,50.22,6.2,5.6000000000000005,6.2,278.15999999999997,null,"Materiale di consumo pulizia",6,21.7,48.6,50.22,50.22,21,6.2,6,50.22,6.2,5.6000000000000005,6.2,278.15999999999997,null,"Materiale di consumo pulizia",6,21.7,48.6,50.22,50.22,21,6.2,6,50.22,6.2,5.6000000000000005,6.2,278.15999999999997]
[null,"Servizi di lavanderia",30,108.5,243,251.10000000000002,251.10000000000002,105,31,30,251.10000000000002,31,28,31,1390.8000000000002,null,"Servizi di lavanderia",30,108.5,243,251.10000000000002,251.10000000000002,105,31,30,251.10000000000002,31,28,31,1390.8000000000002,null,"Servizi di lavanderia",30,108.5,243,251.10000000000002,251.10000000000002,105,31,30,251.10000000000002,31,28,31,1390.8000000000002]
[null,"Visite guidate",0,0,0,0,0,0,0,0,0,0,0,0,0,null,"Visite guidate",0,0,0,0,0,0,0,0,0,0,0,0,0,null,"Visite guidate",0,0,0,0,0,0,0,0,0,0,0,0,0]
[null,"Altri costi variabili",0,0,0,0,0,0,0,0,0,0,0,0,0,null,"Altri costi variabili",0,0,0,0,0,0,0,0,0,0,0,0,0,null,"Altri costi variabili",0,0,0,0,0,0,0,0,0,0,0,0,0]
[null,"Altri costi variabili",0,0,0,0,0,0,0,0,0,0,0,0,0,null,"Altri costi variabili",0,0,0,0,0,0,0,0,0,0,0,0,0,null,"Altri costi variabili",0,0,0,0,0,0,0,0,0,0,0,0,0]
[null,"Altri costi variabili",0,0,0,0,0,0,0,0,0,0,0,0,0,null,"Altri costi variabili",0,0,0,0,0,0,0,0,0,0,0,0,0,null,"Altri costi variabili",0,0,0,0,0,0,0,0,0,0,0,0,0]
[null,"Altri costi variabili",0,0,0,0,0,0,0,0,0,0,0,0,0,null,"Altri costi variabili",0,0,0,0,0,0,0,0,0,0,0,0,0,null,"Altri costi variabili",0,0,0,0,0,0,0,0,0,0,0,0,0]
[null,"Altri costi variabili",0,0,0,0,0,0,0,0,0,0,0,0,0,null,"Altri costi variabili",0,0,0,0,0,0,0,0,0,0,0,0,0,null,"Altri costi variabili",0,0,0,0,0,0,0,0,0,0,0,0,0]
[null,"Altri costi variabili",0,0,0,0,0,0,0,0,0,0,0,0,0,null,"Altri costi variabili",0,0,0,0,0,0,0,0,0,0,0,0,0,null,"Altri costi variabili",0,0,0,0,0,0,0,0,0,0,0,0,0]
[null,"Altri costi variabili",0,0,0,0,0,0,0,0,0,0,0,0,0,null,"Altri costi variabili",0,0,0,0,0,0,0,0,0,0,0,0,0,null,"Altri costi variabili",0,0,0,0,0,0,0,0,0,0,0,0,0]
[null,"Altri costi variabili",0,0,0,0,0,0,0,0,0,0,0,0,0,null,"Altri costi variabili",0,0,0,0,0,0,0,0,0,0,0,0,0,null,"Altri costi variabili",0,0,0,0,0,0,0,0,0,0,0,0,0]
[null,"Altri costi variabili",0,0,0,0,0,0,0,0,0,0,0,0,0,null,"Altri costi variabili",0,0,0,0,0,0,0,0,0,0,0,0,0,null,"Altri costi variabili",0,0,0,0,0,0,0,0,0,0,0,0,0]
[null,"Altri costi variabili",0,0,0,0,0,0,0,0,0,0,0,0,0,null,"Altri costi variabili",0,0,0,0,0,0,0,0,0,0,0,0,0,null,"Altri costi variabili",0,0,0,0,0,0,0,0,0,0,0,0,0]
[null,"TOTALE",{"$f":"SUM(C40:C54)","v":78},{"$f":"SUM(D40:D54)","v":244.9},502.2,518.94000000000005,518.94000000000005,237,80.600000000000009,78,518.94000000000005,80.600000000000009,72.800000000000011,80.600000000000009,{"$f":"SUM(O40:O54)","v":3011.52},null,null,null,null,null,null,null,null,null,null,null,null,null,"TOTALE",{"$f":"SUM(AD40:AD54)","v":3011.52},null,null,null,null,null,null,null,null,null,null,null,null,null,"TOTALE",{"$f":"SUM(AS40:AS54)","v":3011.52}]
[null,"FATTURATO","MESI",null,null,null,null,null,null,null,null,null,null,null,"ANNO 1",null,null,"MESI",null,null,null,null,null,null,null,null,null,null,null,"ANNO 2",null,null,"MESI",null,null,null,null,null,null,null,null,null,null,null,"ANNO 3"]
[null,null,{"$f":"+C39","v":"2016-04-30"},{"$f":"+EOMONTH(C57,1)","v":"2016-05-31"},{"$f":"+EOMONTH(D57,1)","v":"2016-06-30"},{"$f":"+EOMONTH(E57,1)","v":"2016-07-31"},{"$f":"+EOMONTH(F57,1)","v":"2016-08-31"},{"$f":"+EOMONTH(G57,1)","v":"2016-09-30"},{"$f":"+EOMONTH(H57,1)","v":"2016-10-31"},{"$f":"+EOMONTH(I57,1)","v":"2016-11-30"},{"$f":"+EOMONTH(J57,1)","v":"2016-12-31"},{"$f":"+EOMONTH(K57,1)","v":"2017-01-31"},{"$f":"+EOMONTH(L57,1)","v":"2017-02-28"},{"$f":"+EOMONTH(M57,1)","v":"2017-03-31"},"TOTALE","IPOTESI %",{"$f":"+B56","v":"FATTURATO"},{"$f":"+EOMONTH(N57,1)","v":"2017-04-30"},{"$f":"+EOMONTH(R57,1)","v":"2017-05-31"},{"$f":"+EOMONTH(S57,1)","v":"2017-06-30"},{"$f":"+EOMONTH(T57,1)","v":"2017-07-31"},{"$f":"+EOMONTH(U57,1)","v":"2017-08-31"},{"$f":"+EOMONTH(V57,1)","v":"2017-09-30"},{"$f":"+EOMONTH(W57,1)","v":"2017-10-31"},{"$f":"+EOMONTH(X57,1)","v":"2017-11-30"},{"$f":"+EOMONTH(Y57,1)","v":"2017-12-31"},{"$f":"+EOMONTH(Z57,1)","v":"2018-01-31"},{"$f":"+EOMONTH(AA57,1)","v":"2018-02-28"},{"$f":"+EOMONTH(AB57,1)","v":"2018-03-31"},"TOTALE","IPOTESI %",{"$f":"+Q56","v":0},{"$f":"+EOMONTH(AC57,1)","v":"2018-04-30"},{"$f":"+EOMONTH(AG57,1)","v":"2018-05-31"},{"$f":"+EOMONTH(AH57,1)","v":"2018-06-30"},{"$f":"+EOMONTH(AI57,1)","v":"2018-07-31"},{"$f":"+EOMONTH(AJ57,1)","v":"2018-08-31"},{"$f":"+EOMONTH(AK57,1)","v":"2018-09-30"},{"$f":"+EOMONTH(AL57,1)","v":"2018-10-31"},{"$f":"+EOMONTH(AM57,1)","v":"2018-11-30"},{"$f":"+EOMONTH(AN57,1)","v":"2018-12-31"},{"$f":"+EOMONTH(AO57,1)","v":"2019-01-31"},{"$f":"+EOMONTH(AP57,1)","v":"2019-02-28"},{"$f":"+EOMONTH(AQ57,1)","v":"2019-03-31"},"TOTALE"]
[null,{"$f":"+'3) INPUT VENDITE'!A4","v":"CAMERE QUADRUPLE"},{"$f":"+'3) INPUT VENDITE'!B4","v":0},{"$f":"+'3) INPUT VENDITE'!C4","v":0},{"$f":"+'3) INPUT VENDITE'!D4","v":0},{"$f":"+'3) INPUT VENDITE'!E4","v":0},{"$f":"+'3) INPUT VENDITE'!F4","v":0},{"$f":"+'3) INPUT VENDITE'!G4","v":0},{"$f":"+'3) INPUT VENDITE'!H4","v":0},{"$f":"+'3) INPUT VENDITE'!I4","v":0},{"$f":"+'3) INPUT VENDITE'!J4","v":0},{"$f":"+'3) INPUT VENDITE'!K4","v":0},{"$f":"+'3) INPUT VENDITE'!L4","v":0},{"$f":"+'3) INPUT VENDITE'!M4","v":0},{"$f":"+'3) INPUT VENDITE'!N4","v":0},{"$f":"+'3) INPUT VENDITE'!O4","v":0},{"$f":"+B58","v":"CAMERE QUADRUPLE"},{"$f":"+'3) INPUT VENDITE'!P4","v":0},{"$f":"+'3) INPUT VENDITE'!Q4","v":0},{"$f":"+'3) INPUT VENDITE'!R4","v":0},{"$f":"+'3) INPUT VENDITE'!S4","v":0},{"$f":"+'3) INPUT VENDITE'!T4","v":0},{"$f":"+'3) INPUT VENDITE'!U4","v":0},{"$f":"+'3) INPUT VENDITE'!V4","v":0},{"$f":"+'3) INPUT VENDITE'!W4","v":0},{"$f":"+'3) INPUT VENDITE'!X4","v":0},{"$f":"+'3) INPUT VENDITE'!Y4","v":0},{"$f":"+'3) INPUT VENDITE'!Z4","v":0},{"$f":"+'3) INPUT VENDITE'!AA4","v":0},{"$f":"+'3) INPUT VENDITE'!AB4","v":0},{"$f":"+'3) INPUT VENDITE'!AC4","v":0},{"$f":"+Q58","v":"CAMERE QUADRUPLE"},{"$f":"+'3) INPUT VENDITE'!AD4","v":0},{"$f":"+'3) INPUT VENDITE'!AE4","v":0},{"$f":"+'3) INPUT VENDITE'!AF4","v":0},{"$f":"+'3) INPUT VENDITE'!AG4","v":0},{"$f":"+'3) INPUT VENDITE'!AH4","v":0},{"$f":"+'3) INPUT VENDITE'!AI4","v":0},{"$f":"+'3) INPUT VENDITE'!AJ4","v":0},{"$f":"+'3) INPUT VENDITE'!AK4","v":0},{"$f":"+'3) INPUT VENDITE'!AL4","v":0},{"$f":"+'3) INPUT VENDITE'!AM4","v":0},{"$f":"+'3) INPUT VENDITE'!AN4","v":0},{"$f":"+'3) INPUT VENDITE'!AO4","v":0},{"$f":"+'3) INPUT VENDITE'!AP4","v":0}]
[null,{"$f":"+'3) INPUT VENDITE'!A5","v":"CAMERE TRIPLE"},{"$f":"+'3) INPUT VENDITE'!B5","v":0},{"$f":"+'3) INPUT VENDITE'!C5","v":0},{"$f":"+'3) INPUT VENDITE'!D5","v":0},{"$f":"+'3) INPUT VENDITE'!E5","v":0},{"$f":"+'3) INPUT VENDITE'!F5","v":0},{"$f":"+'3) INPUT VENDITE'!G5","v":0},{"$f":"+'3) INPUT VENDITE'!H5","v":0},{"$f":"+'3) INPUT VENDITE'!I5","v":0},{"$f":"+'3) INPUT VENDITE'!J5","v":0},{"$f":"+'3) INPUT VENDITE'!K5","v":0},{"$f":"+'3) INPUT VENDITE'!L5","v":0},{"$f":"+'3) INPUT VENDITE'!M5","v":0},{"$f":"+'3) INPUT VENDITE'!N5","v":0},{"$f":"+'3) INPUT VENDITE'!O5","v":0},{"$f":"+B59","v":"CAMERE TRIPLE"},{"$f":"+'3) INPUT VENDITE'!P5","v":0},{"$f":"+'3) INPUT VENDITE'!Q5","v":0},{"$f":"+'3) INPUT VENDITE'!R5","v":0},{"$f":"+'3) INPUT VENDITE'!S5","v":0},{"$f":"+'3) INPUT VENDITE'!T5","v":0},{"$f":"+'3) INPUT VENDITE'!U5","v":0},{"$f":"+'3) INPUT VENDITE'!V5","v":0},{"$f":"+'3) INPUT VENDITE'!W5","v":0},{"$f":"+'3) INPUT VENDITE'!X5","v":0},{"$f":"+'3) INPUT VENDITE'!Y5","v":0},{"$f":"+'3) INPUT VENDITE'!Z5","v":0},{"$f":"+'3) INPUT VENDITE'!AA5","v":0},{"$f":"+'3) INPUT VENDITE'!AB5","v":0},{"$f":"+'3) INPUT VENDITE'!AC5","v":0},{"$f":"+Q59","v":"CAMERE TRIPLE"},{"$f":"+'3) INPUT VENDITE'!AD5","v":0},{"$f":"+'3) INPUT VENDITE'!AE5","v":0},{"$f":"+'3) INPUT VENDITE'!AF5","v":0},{"$f":"+'3) INPUT VENDITE'!AG5","v":0},{"$f":"+'3) INPUT VENDITE'!AH5","v":0},{"$f":"+'3) INPUT VENDITE'!AI5","v":0},{"$f":"+'3) INPUT VENDITE'!AJ5","v":0},{"$f":"+'3) INPUT VENDITE'!AK5","v":0},{"$f":"+'3) INPUT VENDITE'!AL5","v":0},{"$f":"+'3) INPUT VENDITE'!AM5","v":0},{"$f":"+'3) INPUT VENDITE'!AN5","v":0},{"$f":"+'3) INPUT VENDITE'!AO5","v":0},{"$f":"+'3) INPUT VENDITE'!AP5","v":0}]
[null,{"$f":"+'3) INPUT VENDITE'!A6","v":"CAMERE DOPPIE"},{"$f":"+'3) INPUT VENDITE'!B6","v":600},{"$f":"+'3) INPUT VENDITE'!C6","v":2170},{"$f":"+'3) INPUT VENDITE'!D6","v":4860},{"$f":"+'3) INPUT VENDITE'!E6","v":5022},{"$f":"+'3) INPUT VENDITE'!F6","v":5022},{"$f":"+'3) INPUT VENDITE'!G6","v":2100},{"$f":"+'3) INPUT VENDITE'!H6","v":620},{"$f":"+'3) INPUT VENDITE'!I6","v":600},{"$f":"+'3) INPUT VENDITE'!J6","v":5022},{"$f":"+'3) INPUT VENDITE'!K6","v":620},{"$f":"+'3) INPUT VENDITE'!L6","v":560},{"$f":"+'3) INPUT VENDITE'!M6","v":620},{"$f":"+'3) INPUT VENDITE'!N6","v":27816},{"$f":"+'3) INPUT VENDITE'!O6","v":0},"CAMERE DOPPIE",{"$f":"+'3) INPUT VENDITE'!P6","v":600},{"$f":"+'3) INPUT VENDITE'!Q6","v":2170},{"$f":"+'3) INPUT VENDITE'!R6","v":4860},{"$f":"+'3) INPUT VENDITE'!S6","v":5022},{"$f":"+'3) INPUT VENDITE'!T6","v":5022},{"$f":"+'3) INPUT VENDITE'!U6","v":2100},{"$f":"+'3) INPUT VENDITE'!V6","v":620},{"$f":"+'3) INPUT VENDITE'!W6","v":600},{"$f":"+'3) INPUT VENDITE'!X6","v":5022},{"$f":"+'3) INPUT VENDITE'!Y6","v":620},{"$f":"+'3) INPUT VENDITE'!Z6","v":560},{"$f":"+'3) INPUT VENDITE'!AA6","v":620},{"$f":"+'3) INPUT VENDITE'!AB6","v":27816},{"$f":"+'3) INPUT VENDITE'!AC6","v":0},"CAMERE DOPPIE",{"$f":"+'3) INPUT VENDITE'!AD6","v":600},{"$f":"+'3) INPUT VENDITE'!AE6","v":2170},{"$f":"+'3) INPUT VENDITE'!AF6","v":4860},{"$f":"+'3) INPUT VENDITE'!AG6","v":5022},{"$f":"+'3) INPUT VENDITE'!AH6","v":5022},{"$f":"+'3) INPUT VENDITE'!AI6","v":2100},{"$f":"+'3) INPUT VENDITE'!AJ6","v":620},{"$f":"+'3) INPUT VENDITE'!AK6","v":600},{"$f":"+'3) INPUT VENDITE'!AL6","v":5022},{"$f":"+'3) INPUT VENDITE'!AM6","v":620},{"$f":"+'3) INPUT VENDITE'!AN6","v":560},{"$f":"+'3) INPUT VENDITE'!AO6","v":620},{"$f":"+'3) INPUT VENDITE'!AP6","v":27816}]
[null,{"$f":"+'3) INPUT VENDITE'!A7","v":"CAMERE SINGOLE"},{"$f":"+'3) INPUT VENDITE'!B7","v":0},{"$f":"+'3) INPUT VENDITE'!C7","v":0},{"$f":"+'3) INPUT VENDITE'!D7","v":0},{"$f":"+'3) INPUT VENDITE'!E7","v":0},{"$f":"+'3) INPUT VENDITE'!F7","v":0},{"$f":"+'3) INPUT VENDITE'!G7","v":0},{"$f":"+'3) INPUT VENDITE'!H7","v":0},{"$f":"+'3) INPUT VENDITE'!I7","v":0},{"$f":"+'3) INPUT VENDITE'!J7","v":0},{"$f":"+'3) INPUT VENDITE'!K7","v":0},{"$f":"+'3) INPUT VENDITE'!L7","v":0},{"$f":"+'3) INPUT VENDITE'!M7","v":0},{"$f":"+'3) INPUT VENDITE'!N7","v":0},{"$f":"+'3) INPUT VENDITE'!O7","v":0},"CAMERE SINGOLE",{"$f":"+'3) INPUT VENDITE'!P7","v":0},{"$f":"+'3) INPUT VENDITE'!Q7","v":0},{"$f":"+'3) INPUT VENDITE'!R7","v":0},{"$f":"+'3) INPUT VENDITE'!S7","v":0},{"$f":"+'3) INPUT VENDITE'!T7","v":0},{"$f":"+'3) INPUT VENDITE'!U7","v":0},{"$f":"+'3) INPUT VENDITE'!V7","v":0},{"$f":"+'3) INPUT VENDITE'!W7","v":0},{"$f":"+'3) INPUT VENDITE'!X7","v":0},{"$f":"+'3) INPUT VENDITE'!Y7","v":0},{"$f":"+'3) INPUT VENDITE'!Z7","v":0},{"$f":"+'3) INPUT VENDITE'!AA7","v":0},{"$f":"+'3) INPUT VENDITE'!AB7","v":0},{"$f":"+'3) INPUT VENDITE'!AC7","v":0},"CAMERE SINGOLE",{"$f":"+'3) INPUT VENDITE'!AD7","v":0},{"$f":"+'3) INPUT VENDITE'!AE7","v":0},{"$f":"+'3) INPUT VENDITE'!AF7","v":0},{"$f":"+'3) INPUT VENDITE'!AG7","v":0},{"$f":"+'3) INPUT VENDITE'!AH7","v":0},{"$f":"+'3) INPUT VENDITE'!AI7","v":0},{"$f":"+'3) INPUT VENDITE'!AJ7","v":0},{"$f":"+'3) INPUT VENDITE'!AK7","v":0},{"$f":"+'3) INPUT VENDITE'!AL7","v":0},{"$f":"+'3) INPUT VENDITE'!AM7","v":0},{"$f":"+'3) INPUT VENDITE'!AN7","v":0},{"$f":"+'3) INPUT VENDITE'!AO7","v":0},{"$f":"+'3) INPUT VENDITE'!AP7","v":0}]
[null,{"$f":"+'3) INPUT VENDITE'!A8","v":"VISITE GUIDATE"},{"$f":"+'3) INPUT VENDITE'!B8","v":0},{"$f":"+'3) INPUT VENDITE'!C8","v":0},{"$f":"+'3) INPUT VENDITE'!D8","v":0},{"$f":"+'3) INPUT VENDITE'!E8","v":0},{"$f":"+'3) INPUT VENDITE'!F8","v":0},{"$f":"+'3) INPUT VENDITE'!G8","v":0},{"$f":"+'3) INPUT VENDITE'!H8","v":0},{"$f":"+'3) INPUT VENDITE'!I8","v":0},{"$f":"+'3) INPUT VENDITE'!J8","v":0},{"$f":"+'3) INPUT VENDITE'!K8","v":0},{"$f":"+'3) INPUT VENDITE'!L8","v":0},{"$f":"+'3) INPUT VENDITE'!M8","v":0},{"$f":"+'3) INPUT VENDITE'!N8","v":0},{"$f":"+'3) INPUT VENDITE'!O8","v":0},"VISITE GUIDATE",{"$f":"+'3) INPUT VENDITE'!P8","v":0},{"$f":"+'3) INPUT VENDITE'!Q8","v":0},{"$f":"+'3) INPUT VENDITE'!R8","v":0},{"$f":"+'3) INPUT VENDITE'!S8","v":0},{"$f":"+'3) INPUT VENDITE'!T8","v":0},{"$f":"+'3) INPUT VENDITE'!U8","v":0},{"$f":"+'3) INPUT VENDITE'!V8","v":0},{"$f":"+'3) INPUT VENDITE'!W8","v":0},{"$f":"+'3) INPUT VENDITE'!X8","v":0},{"$f":"+'3) INPUT VENDITE'!Y8","v":0},{"$f":"+'3) INPUT VENDITE'!Z8","v":0},{"$f":"+'3) INPUT VENDITE'!AA8","v":0},{"$f":"+'3) INPUT VENDITE'!AB8","v":0},{"$f":"+'3) INPUT VENDITE'!AC8","v":0},"VISITE GUIDATE",{"$f":"+'3) INPUT VENDITE'!AD8","v":0},{"$f":"+'3) INPUT VENDITE'!AE8","v":0},{"$f":"+'3) INPUT VENDITE'!AF8","v":0},{"$f":"+'3) INPUT VENDITE'!AG8","v":0},{"$f":"+'3) INPUT VENDITE'!AH8","v":0},{"$f":"+'3) INPUT VENDITE'!AI8","v":0},{"$f":"+'3) INPUT VENDITE'!AJ8","v":0},{"$f":"+'3) INPUT VENDITE'!AK8","v":0},{"$f":"+'3) INPUT VENDITE'!AL8","v":0},{"$f":"+'3) INPUT VENDITE'!AM8","v":0},{"$f":"+'3) INPUT VENDITE'!AN8","v":0},{"$f":"+'3) INPUT VENDITE'!AO8","v":0},{"$f":"+'3) INPUT VENDITE'!AP8","v":0}]
[null,{"$f":"+'3) INPUT VENDITE'!A9","v":"Altri ricavi"},{"$f":"+'3) INPUT VENDITE'!B9","v":0},{"$f":"+'3) INPUT VENDITE'!C9","v":0},{"$f":"+'3) INPUT VENDITE'!D9","v":0},{"$f":"+'3) INPUT VENDITE'!E9","v":0},{"$f":"+'3) INPUT VENDITE'!F9","v":0},{"$f":"+'3) INPUT VENDITE'!G9","v":0},{"$f":"+'3) INPUT VENDITE'!H9","v":0},{"$f":"+'3) INPUT VENDITE'!I9","v":0},{"$f":"+'3) INPUT VENDITE'!J9","v":0},{"$f":"+'3) INPUT VENDITE'!K9","v":0},{"$f":"+'3) INPUT VENDITE'!L9","v":0},{"$f":"+'3) INPUT VENDITE'!M9","v":0},{"$f":"+'3) INPUT VENDITE'!N9","v":0},{"$f":"+'3) INPUT VENDITE'!O9","v":0},"Altri ricavi",{"$f":"+'3) INPUT VENDITE'!P9","v":0},{"$f":"+'3) INPUT VENDITE'!Q9","v":0},{"$f":"+'3) INPUT VENDITE'!R9","v":0},{"$f":"+'3) INPUT VENDITE'!S9","v":0},{"$f":"+'3) INPUT VENDITE'!T9","v":0},{"$f":"+'3) INPUT VENDITE'!U9","v":0},{"$f":"+'3) INPUT VENDITE'!V9","v":0},{"$f":"+'3) INPUT VENDITE'!W9","v":0},{"$f":"+'3) INPUT VENDITE'!X9","v":0},{"$f":"+'3) INPUT VENDITE'!Y9","v":0},{"$f":"+'3) INPUT VENDITE'!Z9","v":0},{"$f":"+'3) INPUT VENDITE'!AA9","v":0},{"$f":"+'3) INPUT VENDITE'!AB9","v":0},{"$f":"+'3) INPUT VENDITE'!AC9","v":0},"Altri ricavi",{"$f":"+'3) INPUT VENDITE'!AD9","v":0},{"$f":"+'3) INPUT VENDITE'!AE9","v":0},{"$f":"+'3) INPUT VENDITE'!AF9","v":0},{"$f":"+'3) INPUT VENDITE'!AG9","v":0},{"$f":"+'3) INPUT VENDITE'!AH9","v":0},{"$f":"+'3) INPUT VENDITE'!AI9","v":0},{"$f":"+'3) INPUT VENDITE'!AJ9","v":0},{"$f":"+'3) INPUT VENDITE'!AK9","v":0},{"$f":"+'3) INPUT VENDITE'!AL9","v":0},{"$f":"+'3) INPUT VENDITE'!AM9","v":0},{"$f":"+'3) INPUT VENDITE'!AN9","v":0},{"$f":"+'3) INPUT VENDITE'!AO9","v":0},{"$f":"+'3) INPUT VENDITE'!AP9","v":0}]
[null,{"$f":"+'3) INPUT VENDITE'!A10","v":"Altri ricavi"},{"$f":"+'3) INPUT VENDITE'!B10","v":0},{"$f":"+'3) INPUT VENDITE'!C10","v":0},{"$f":"+'3) INPUT VENDITE'!D10","v":0},{"$f":"+'3) INPUT VENDITE'!E10","v":0},{"$f":"+'3) INPUT VENDITE'!F10","v":0},{"$f":"+'3) INPUT VENDITE'!G10","v":0},{"$f":"+'3) INPUT VENDITE'!H10","v":0},{"$f":"+'3) INPUT VENDITE'!I10","v":0},{"$f":"+'3) INPUT VENDITE'!J10","v":0},{"$f":"+'3) INPUT VENDITE'!K10","v":0},{"$f":"+'3) INPUT VENDITE'!L10","v":0},{"$f":"+'3) INPUT VENDITE'!M10","v":0},{"$f":"+'3) INPUT VENDITE'!N10","v":0},{"$f":"+'3) INPUT VENDITE'!O10","v":0},"Altri ricavi",{"$f":"+'3) INPUT VENDITE'!P10","v":0},{"$f":"+'3) INPUT VENDITE'!Q10","v":0},{"$f":"+'3) INPUT VENDITE'!R10","v":0},{"$f":"+'3) INPUT VENDITE'!S10","v":0},{"$f":"+'3) INPUT VENDITE'!T10","v":0},{"$f":"+'3) INPUT VENDITE'!U10","v":0},{"$f":"+'3) INPUT VENDITE'!V10","v":0},{"$f":"+'3) INPUT VENDITE'!W10","v":0},{"$f":"+'3) INPUT VENDITE'!X10","v":0},{"$f":"+'3) INPUT VENDITE'!Y10","v":0},{"$f":"+'3) INPUT VENDITE'!Z10","v":0},{"$f":"+'3) INPUT VENDITE'!AA10","v":0},{"$f":"+'3) INPUT VENDITE'!AB10","v":0},{"$f":"+'3) INPUT VENDITE'!AC10","v":0},"Altri ricavi",{"$f":"+'3) INPUT VENDITE'!AD10","v":0},{"$f":"+'3) INPUT VENDITE'!AE10","v":0},{"$f":"+'3) INPUT VENDITE'!AF10","v":0},{"$f":"+'3) INPUT VENDITE'!AG10","v":0},{"$f":"+'3) INPUT VENDITE'!AH10","v":0},{"$f":"+'3) INPUT VENDITE'!AI10","v":0},{"$f":"+'3) INPUT VENDITE'!AJ10","v":0},{"$f":"+'3) INPUT VENDITE'!AK10","v":0},{"$f":"+'3) INPUT VENDITE'!AL10","v":0},{"$f":"+'3) INPUT VENDITE'!AM10","v":0},{"$f":"+'3) INPUT VENDITE'!AN10","v":0},{"$f":"+'3) INPUT VENDITE'!AO10","v":0},{"$f":"+'3) INPUT VENDITE'!AP10","v":0}]
[null,{"$f":"+'3) INPUT VENDITE'!A11","v":"Altri ricavi"},{"$f":"+'3) INPUT VENDITE'!B11","v":0},{"$f":"+'3) INPUT VENDITE'!C11","v":0},{"$f":"+'3) INPUT VENDITE'!D11","v":0},{"$f":"+'3) INPUT VENDITE'!E11","v":0},{"$f":"+'3) INPUT VENDITE'!F11","v":0},{"$f":"+'3) INPUT VENDITE'!G11","v":0},{"$f":"+'3) INPUT VENDITE'!H11","v":0},{"$f":"+'3) INPUT VENDITE'!I11","v":0},{"$f":"+'3) INPUT VENDITE'!J11","v":0},{"$f":"+'3) INPUT VENDITE'!K11","v":0},{"$f":"+'3) INPUT VENDITE'!L11","v":0},{"$f":"+'3) INPUT VENDITE'!M11","v":0},{"$f":"+'3) INPUT VENDITE'!N11","v":0},{"$f":"+'3) INPUT VENDITE'!O11","v":0},"Altri ricavi",{"$f":"+'3) INPUT VENDITE'!P11","v":0},{"$f":"+'3) INPUT VENDITE'!Q11","v":0},{"$f":"+'3) INPUT VENDITE'!R11","v":0},{"$f":"+'3) INPUT VENDITE'!S11","v":0},{"$f":"+'3) INPUT VENDITE'!T11","v":0},{"$f":"+'3) INPUT VENDITE'!U11","v":0},{"$f":"+'3) INPUT VENDITE'!V11","v":0},{"$f":"+'3) INPUT VENDITE'!W11","v":0},{"$f":"+'3) INPUT VENDITE'!X11","v":0},{"$f":"+'3) INPUT VENDITE'!Y11","v":0},{"$f":"+'3) INPUT VENDITE'!Z11","v":0},{"$f":"+'3) INPUT VENDITE'!AA11","v":0},{"$f":"+'3) INPUT VENDITE'!AB11","v":0},{"$f":"+'3) INPUT VENDITE'!AC11","v":0},"Altri ricavi",{"$f":"+'3) INPUT VENDITE'!AD11","v":0},{"$f":"+'3) INPUT VENDITE'!AE11","v":0},{"$f":"+'3) INPUT VENDITE'!AF11","v":0},{"$f":"+'3) INPUT VENDITE'!AG11","v":0},{"$f":"+'3) INPUT VENDITE'!AH11","v":0},{"$f":"+'3) INPUT VENDITE'!AI11","v":0},{"$f":"+'3) INPUT VENDITE'!AJ11","v":0},{"$f":"+'3) INPUT VENDITE'!AK11","v":0},{"$f":"+'3) INPUT VENDITE'!AL11","v":0},{"$f":"+'3) INPUT VENDITE'!AM11","v":0},{"$f":"+'3) INPUT VENDITE'!AN11","v":0},{"$f":"+'3) INPUT VENDITE'!AO11","v":0},{"$f":"+'3) INPUT VENDITE'!AP11","v":0}]
[null,{"$f":"+'3) INPUT VENDITE'!A12","v":"Altri ricavi"},{"$f":"+'3) INPUT VENDITE'!B12","v":0},{"$f":"+'3) INPUT VENDITE'!C12","v":0},{"$f":"+'3) INPUT VENDITE'!D12","v":0},{"$f":"+'3) INPUT VENDITE'!E12","v":0},{"$f":"+'3) INPUT VENDITE'!F12","v":0},{"$f":"+'3) INPUT VENDITE'!G12","v":0},{"$f":"+'3) INPUT VENDITE'!H12","v":0},{"$f":"+'3) INPUT VENDITE'!I12","v":0},{"$f":"+'3) INPUT VENDITE'!J12","v":0},{"$f":"+'3) INPUT VENDITE'!K12","v":0},{"$f":"+'3) INPUT VENDITE'!L12","v":0},{"$f":"+'3) INPUT VENDITE'!M12","v":0},{"$f":"+'3) INPUT VENDITE'!N12","v":0},{"$f":"+'3) INPUT VENDITE'!O12","v":0},"Altri ricavi",{"$f":"+'3) INPUT VENDITE'!P12","v":0},{"$f":"+'3) INPUT VENDITE'!Q12","v":0},{"$f":"+'3) INPUT VENDITE'!R12","v":0},{"$f":"+'3) INPUT VENDITE'!S12","v":0},{"$f":"+'3) INPUT VENDITE'!T12","v":0},{"$f":"+'3) INPUT VENDITE'!U12","v":0},{"$f":"+'3) INPUT VENDITE'!V12","v":0},{"$f":"+'3) INPUT VENDITE'!W12","v":0},{"$f":"+'3) INPUT VENDITE'!X12","v":0},{"$f":"+'3) INPUT VENDITE'!Y12","v":0},{"$f":"+'3) INPUT VENDITE'!Z12","v":0},{"$f":"+'3) INPUT VENDITE'!AA12","v":0},{"$f":"+'3) INPUT VENDITE'!AB12","v":0},{"$f":"+'3) INPUT VENDITE'!AC12","v":0},"Altri ricavi",{"$f":"+'3) INPUT VENDITE'!AD12","v":0},{"$f":"+'3) INPUT VENDITE'!AE12","v":0},{"$f":"+'3) INPUT VENDITE'!AF12","v":0},{"$f":"+'3) INPUT VENDITE'!AG12","v":0},{"$f":"+'3) INPUT VENDITE'!AH12","v":0},{"$f":"+'3) INPUT VENDITE'!AI12","v":0},{"$f":"+'3) INPUT VENDITE'!AJ12","v":0},{"$f":"+'3) INPUT VENDITE'!AK12","v":0},{"$f":"+'3) INPUT VENDITE'!AL12","v":0},{"$f":"+'3) INPUT VENDITE'!AM12","v":0},{"$f":"+'3) INPUT VENDITE'!AN12","v":0},{"$f":"+'3) INPUT VENDITE'!AO12","v":0},{"$f":"+'3) INPUT VENDITE'!AP12","v":0}]
[null,{"$f":"+'3) INPUT VENDITE'!A13","v":"Altri ricavi"},{"$f":"+'3) INPUT VENDITE'!B13","v":0},{"$f":"+'3) INPUT VENDITE'!C13","v":0},{"$f":"+'3) INPUT VENDITE'!D13","v":0},{"$f":"+'3) INPUT VENDITE'!E13","v":0},{"$f":"+'3) INPUT VENDITE'!F13","v":0},{"$f":"+'3) INPUT VENDITE'!G13","v":0},{"$f":"+'3) INPUT VENDITE'!H13","v":0},{"$f":"+'3) INPUT VENDITE'!I13","v":0},{"$f":"+'3) INPUT VENDITE'!J13","v":0},{"$f":"+'3) INPUT VENDITE'!K13","v":0},{"$f":"+'3) INPUT VENDITE'!L13","v":0},{"$f":"+'3) INPUT VENDITE'!M13","v":0},{"$f":"+'3) INPUT VENDITE'!N13","v":0},{"$f":"+'3) INPUT VENDITE'!O13","v":0},"Altri ricavi",{"$f":"+'3) INPUT VENDITE'!P13","v":0},{"$f":"+'3) INPUT VENDITE'!Q13","v":0},{"$f":"+'3) INPUT VENDITE'!R13","v":0},{"$f":"+'3) INPUT VENDITE'!S13","v":0},{"$f":"+'3) INPUT VENDITE'!T13","v":0},{"$f":"+'3) INPUT VENDITE'!U13","v":0},{"$f":"+'3) INPUT VENDITE'!V13","v":0},{"$f":"+'3) INPUT VENDITE'!W13","v":0},{"$f":"+'3) INPUT VENDITE'!X13","v":0},{"$f":"+'3) INPUT VENDITE'!Y13","v":0},{"$f":"+'3) INPUT VENDITE'!Z13","v":0},{"$f":"+'3) INPUT VENDITE'!AA13","v":0},{"$f":"+'3) INPUT VENDITE'!AB13","v":0},{"$f":"+'3) INPUT VENDITE'!AC13","v":0},"Altri ricavi",{"$f":"+'3) INPUT VENDITE'!AD13","v":0},{"$f":"+'3) INPUT VENDITE'!AE13","v":0},{"$f":"+'3) INPUT VENDITE'!AF13","v":0},{"$f":"+'3) INPUT VENDITE'!AG13","v":0},{"$f":"+'3) INPUT VENDITE'!AH13","v":0},{"$f":"+'3) INPUT VENDITE'!AI13","v":0},{"$f":"+'3) INPUT VENDITE'!AJ13","v":0},{"$f":"+'3) INPUT VENDITE'!AK13","v":0},{"$f":"+'3) INPUT VENDITE'!AL13","v":0},{"$f":"+'3) INPUT VENDITE'!AM13","v":0},{"$f":"+'3) INPUT VENDITE'!AN13","v":0},{"$f":"+'3) INPUT VENDITE'!AO13","v":0},{"$f":"+'3) INPUT VENDITE'!AP13","v":0}]
[null,{"$f":"+B33","v":"TOTALE CAMERE"},{"$f":"SUM(C58:C61)","v":600},{"$f":"SUM(D58:D61)","v":2170},4860,5022,5022,2100,620,600,5022,620,560,{"$f":"SUM(N58:N61)","v":620},{"$f":"SUM(C68:N68)","v":27816},null,"TOTALE CAMERE",{"$f":"SUM(R58:R61)","v":600},{"$f":"SUM(S58:S61)","v":2170},4860,5022,5022,2100,620,600,5022,620,560,620,{"$f":"SUM(R68:AC68)","v":27816},null,"TOTALE CAMERE",{"$f":"SUM(AG58:AG61)","v":600},{"$f":"SUM(AH58:AH61)","v":2170},4860,5022,5022,2100,620,600,5022,620,560,620,{"$f":"SUM(AG68:AR68)","v":27816}]
[null,"PRENOTAZIONI","MESI",null,null,null,null,null,null,null,null,null,null,null,"ANNO 1",null,null,"MESI",null,null,null,null,null,null,null,null,null,null,null,"ANNO 2",null,null,"MESI",null,null,null,null,null,null,null,null,null,null,null,"ANNO3"]
[null,null,{"$f":"+C57","v":"2016-04-30"},{"$f":"+EOMONTH(C70,1)","v":"2016-05-31"},{"$f":"+EOMONTH(D70,1)","v":"2016-06-30"},{"$f":"+EOMONTH(E70,1)","v":"2016-07-31"},{"$f":"+EOMONTH(F70,1)","v":"2016-08-31"},{"$f":"+EOMONTH(G70,1)","v":"2016-09-30"},{"$f":"+EOMONTH(H70,1)","v":"2016-10-31"},{"$f":"+EOMONTH(I70,1)","v":"2016-11-30"},{"$f":"+EOMONTH(J70,1)","v":"2016-12-31"},{"$f":"+EOMONTH(K70,1)","v":"2017-01-31"},{"$f":"+EOMONTH(L70,1)","v":"2017-02-28"},{"$f":"+EOMONTH(M70,1)","v":"2017-03-31"},"TOTALE","IPOTESI %",{"$f":"+B69","v":"PRENOTAZIONI"},{"$f":"+EOMONTH(N70,1)","v":"2017-04-30"},{"$f":"+EOMONTH(R70,1)","v":"2017-05-31"},{"$f":"+EOMONTH(S70,1)","v":"2017-06-30"},{"$f":"+EOMONTH(T70,1)","v":"2017-07-31"},{"$f":"+EOMONTH(U70,1)","v":"2017-08-31"},{"$f":"+EOMONTH(V70,1)","v":"2017-09-30"},{"$f":"+EOMONTH(W70,1)","v":"2017-10-31"},{"$f":"+EOMONTH(X70,1)","v":"2017-11-30"},{"$f":"+EOMONTH(Y70,1)","v":"2017-12-31"},{"$f":"+EOMONTH(Z70,1)","v":"2018-01-31"},{"$f":"+EOMONTH(AA70,1)","v":"2018-02-28"},{"$f":"+EOMONTH(AB70,1)","v":"2018-03-31"},"TOTALE","IPOTESI %",{"$f":"+Q69","v":0},{"$f":"+EOMONTH(AC70,1)","v":"2018-04-30"},{"$f":"+EOMONTH(AG70,1)","v":"2018-05-31"},{"$f":"+EOMONTH(AH70,1)","v":"2018-06-30"},{"$f":"+EOMONTH(AI70,1)","v":"2018-07-31"},{"$f":"+EOMONTH(AJ70,1)","v":"2018-08-31"},{"$f":"+EOMONTH(AK70,1)","v":"2018-09-30"},{"$f":"+EOMONTH(AL70,1)","v":"2018-10-31"},{"$f":"+EOMONTH(AM70,1)","v":"2018-11-30"},{"$f":"+EOMONTH(AN70,1)","v":"2018-12-31"},{"$f":"+EOMONTH(AO70,1)","v":"2019-01-31"},{"$f":"+EOMONTH(AP70,1)","v":"2019-02-28"},{"$f":"+EOMONTH(AQ70,1)","v":"2019-03-31"},"TOTALE"]
[null,{"$f":"+'3) INPUT VENDITE'!A17","v":"CAMERE QUADRUPLE"},{"$f":"+'3) INPUT VENDITE'!B17","v":0},{"$f":"+'3) INPUT VENDITE'!C17","v":0},{"$f":"+'3) INPUT VENDITE'!D17","v":0},{"$f":"+'3) INPUT VENDITE'!E17","v":0},{"$f":"+'3) INPUT VENDITE'!F17","v":0},{"$f":"+'3) INPUT VENDITE'!G17","v":0},{"$f":"+'3) INPUT VENDITE'!H17","v":0},{"$f":"+'3) INPUT VENDITE'!I17","v":0},{"$f":"+'3) INPUT VENDITE'!J17","v":0},{"$f":"+'3) INPUT VENDITE'!K17","v":0},{"$f":"+'3) INPUT VENDITE'!L17","v":0},{"$f":"+'3) INPUT VENDITE'!M17","v":0},{"$f":"+'3) INPUT VENDITE'!N17","v":0},{"$f":"+'3) INPUT VENDITE'!O17","v":0},{"$f":"+B71","v":"CAMERE QUADRUPLE"},{"$f":"+'3) INPUT VENDITE'!P17","v":0},{"$f":"+'3) INPUT VENDITE'!Q17","v":0},{"$f":"+'3) INPUT VENDITE'!R17","v":0},{"$f":"+'3) INPUT VENDITE'!S17","v":0},{"$f":"+'3) INPUT VENDITE'!T17","v":0},{"$f":"+'3) INPUT VENDITE'!U17","v":0},{"$f":"+'3) INPUT VENDITE'!V17","v":0},{"$f":"+'3) INPUT VENDITE'!W17","v":0},{"$f":"+'3) INPUT VENDITE'!X17","v":0},{"$f":"+'3) INPUT VENDITE'!Y17","v":0},{"$f":"+'3) INPUT VENDITE'!Z17","v":0},{"$f":"+'3) INPUT VENDITE'!AA17","v":0},{"$f":"+'3) INPUT VENDITE'!AB17","v":0},{"$f":"+'3) INPUT VENDITE'!AC17","v":0},{"$f":"+Q71","v":"CAMERE QUADRUPLE"},{"$f":"+'3) INPUT VENDITE'!AD17","v":0},{"$f":"+'3) INPUT VENDITE'!AE17","v":0},{"$f":"+'3) INPUT VENDITE'!AF17","v":0},{"$f":"+'3) INPUT VENDITE'!AG17","v":0},{"$f":"+'3) INPUT VENDITE'!AH17","v":0},{"$f":"+'3) INPUT VENDITE'!AI17","v":0},{"$f":"+'3) INPUT VENDITE'!AJ17","v":0},{"$f":"+'3) INPUT VENDITE'!AK17","v":0},{"$f":"+'3) INPUT VENDITE'!AL17","v":0},{"$f":"+'3) INPUT VENDITE'!AM17","v":0},{"$f":"+'3) INPUT VENDITE'!AN17","v":0},{"$f":"+'3) INPUT VENDITE'!AO17","v":0},{"$f":"+'3) INPUT VENDITE'!AP17","v":0}]
[null,{"$f":"+'3) INPUT VENDITE'!A18","v":"CAMERE TRIPLE"},{"$f":"+'3) INPUT VENDITE'!B18","v":0},{"$f":"+'3) INPUT VENDITE'!C18","v":0},{"$f":"+'3) INPUT VENDITE'!D18","v":0},{"$f":"+'3) INPUT VENDITE'!E18","v":0},{"$f":"+'3) INPUT VENDITE'!F18","v":0},{"$f":"+'3) INPUT VENDITE'!G18","v":0},{"$f":"+'3) INPUT VENDITE'!H18","v":0},{"$f":"+'3) INPUT VENDITE'!I18","v":0},{"$f":"+'3) INPUT VENDITE'!J18","v":0},{"$f":"+'3) INPUT VENDITE'!K18","v":0},{"$f":"+'3) INPUT VENDITE'!L18","v":0},{"$f":"+'3) INPUT VENDITE'!M18","v":0},{"$f":"+'3) INPUT VENDITE'!N18","v":0},{"$f":"+'3) INPUT VENDITE'!O18","v":0},{"$f":"+B72","v":"CAMERE TRIPLE"},{"$f":"+'3) INPUT VENDITE'!P18","v":0},{"$f":"+'3) INPUT VENDITE'!Q18","v":0},{"$f":"+'3) INPUT VENDITE'!R18","v":0},{"$f":"+'3) INPUT VENDITE'!S18","v":0},{"$f":"+'3) INPUT VENDITE'!T18","v":0},{"$f":"+'3) INPUT VENDITE'!U18","v":0},{"$f":"+'3) INPUT VENDITE'!V18","v":0},{"$f":"+'3) INPUT VENDITE'!W18","v":0},{"$f":"+'3) INPUT VENDITE'!X18","v":0},{"$f":"+'3) INPUT VENDITE'!Y18","v":0},{"$f":"+'3) INPUT VENDITE'!Z18","v":0},{"$f":"+'3) INPUT VENDITE'!AA18","v":0},{"$f":"+'3) INPUT VENDITE'!AB18","v":0},{"$f":"+'3) INPUT VENDITE'!AC18","v":0},{"$f":"+Q72","v":"CAMERE TRIPLE"},{"$f":"+'3) INPUT VENDITE'!AD18","v":0},{"$f":"+'3) INPUT VENDITE'!AE18","v":0},{"$f":"+'3) INPUT VENDITE'!AF18","v":0},{"$f":"+'3) INPUT VENDITE'!AG18","v":0},{"$f":"+'3) INPUT VENDITE'!AH18","v":0},{"$f":"+'3) INPUT VENDITE'!AI18","v":0},{"$f":"+'3) INPUT VENDITE'!AJ18","v":0},{"$f":"+'3) INPUT VENDITE'!AK18","v":0},{"$f":"+'3) INPUT VENDITE'!AL18","v":0},{"$f":"+'3) INPUT VENDITE'!AM18","v":0},{"$f":"+'3) INPUT VENDITE'!AN18","v":0},{"$f":"+'3) INPUT VENDITE'!AO18","v":0},{"$f":"+'3) INPUT VENDITE'!AP18","v":0}]
[null,{"$f":"+'3) INPUT VENDITE'!A19","v":"CAMERE DOPPIE"},{"$f":"+'3) INPUT VENDITE'!B19","v":12},{"$f":"+'3) INPUT VENDITE'!C19","v":31},{"$f":"+'3) INPUT VENDITE'!D19","v":54},{"$f":"+'3) INPUT VENDITE'!E19","v":55.800000000000004},{"$f":"+'3) INPUT VENDITE'!F19","v":55.800000000000004},{"$f":"+'3) INPUT VENDITE'!G19","v":30},{"$f":"+'3) INPUT VENDITE'!H19","v":12.4},{"$f":"+'3) INPUT VENDITE'!I19","v":12},{"$f":"+'3) INPUT VENDITE'!J19","v":55.800000000000004},{"$f":"+'3) INPUT VENDITE'!K19","v":12.4},{"$f":"+'3) INPUT VENDITE'!L19","v":11.200000000000001},{"$f":"+'3) INPUT VENDITE'!M19","v":12.4},{"$f":"+'3) INPUT VENDITE'!N19","v":354.79999999999995},{"$f":"+'3) INPUT VENDITE'!O19","v":0},"CAMERE DOPPIE",{"$f":"+'3) INPUT VENDITE'!P19","v":12},{"$f":"+'3) INPUT VENDITE'!Q19","v":31},{"$f":"+'3) INPUT VENDITE'!R19","v":54},{"$f":"+'3) INPUT VENDITE'!S19","v":55.800000000000004},{"$f":"+'3) INPUT VENDITE'!T19","v":55.800000000000004},{"$f":"+'3) INPUT VENDITE'!U19","v":30},{"$f":"+'3) INPUT VENDITE'!V19","v":12.4},{"$f":"+'3) INPUT VENDITE'!W19","v":12},{"$f":"+'3) INPUT VENDITE'!X19","v":55.800000000000004},{"$f":"+'3) INPUT VENDITE'!Y19","v":12.4},{"$f":"+'3) INPUT VENDITE'!Z19","v":11.200000000000001},{"$f":"+'3) INPUT VENDITE'!AA19","v":12.4},{"$f":"+'3) INPUT VENDITE'!AB19","v":354.79999999999995},{"$f":"+'3) INPUT VENDITE'!AC19","v":0},"CAMERE DOPPIE",{"$f":"+'3) INPUT VENDITE'!AD19","v":12},{"$f":"+'3) INPUT VENDITE'!AE19","v":31},{"$f":"+'3) INPUT VENDITE'!AF19","v":54},{"$f":"+'3) INPUT VENDITE'!AG19","v":55.800000000000004},{"$f":"+'3) INPUT VENDITE'!AH19","v":55.800000000000004},{"$f":"+'3) INPUT VENDITE'!AI19","v":30},{"$f":"+'3) INPUT VENDITE'!AJ19","v":12.4},{"$f":"+'3) INPUT VENDITE'!AK19","v":12},{"$f":"+'3) INPUT VENDITE'!AL19","v":55.800000000000004},{"$f":"+'3) INPUT VENDITE'!AM19","v":12.4},{"$f":"+'3) INPUT VENDITE'!AN19","v":11.200000000000001},{"$f":"+'3) INPUT VENDITE'!AO19","v":12.4},{"$f":"+'3) INPUT VENDITE'!AP19","v":354.79999999999995}]
[null,{"$f":"+'3) INPUT VENDITE'!A20","v":"CAMERE SINGOLE"},{"$f":"+'3) INPUT VENDITE'!B20","v":0},{"$f":"+'3) INPUT VENDITE'!C20","v":0},{"$f":"+'3) INPUT VENDITE'!D20","v":0},{"$f":"+'3) INPUT VENDITE'!E20","v":0},{"$f":"+'3) INPUT VENDITE'!F20","v":0},{"$f":"+'3) INPUT VENDITE'!G20","v":0},{"$f":"+'3) INPUT VENDITE'!H20","v":0},{"$f":"+'3) INPUT VENDITE'!I20","v":0},{"$f":"+'3) INPUT VENDITE'!J20","v":0},{"$f":"+'3) INPUT VENDITE'!K20","v":0},{"$f":"+'3) INPUT VENDITE'!L20","v":0},{"$f":"+'3) INPUT VENDITE'!M20","v":0},{"$f":"+'3) INPUT VENDITE'!N20","v":0},{"$f":"+'3) INPUT VENDITE'!O20","v":0},"CAMERE SINGOLE",{"$f":"+'3) INPUT VENDITE'!P20","v":0},{"$f":"+'3) INPUT VENDITE'!Q20","v":0},{"$f":"+'3) INPUT VENDITE'!R20","v":0},{"$f":"+'3) INPUT VENDITE'!S20","v":0},{"$f":"+'3) INPUT VENDITE'!T20","v":0},{"$f":"+'3) INPUT VENDITE'!U20","v":0},{"$f":"+'3) INPUT VENDITE'!V20","v":0},{"$f":"+'3) INPUT VENDITE'!W20","v":0},{"$f":"+'3) INPUT VENDITE'!X20","v":0},{"$f":"+'3) INPUT VENDITE'!Y20","v":0},{"$f":"+'3) INPUT VENDITE'!Z20","v":0},{"$f":"+'3) INPUT VENDITE'!AA20","v":0},{"$f":"+'3) INPUT VENDITE'!AB20","v":0},{"$f":"+'3) INPUT VENDITE'!AC20","v":0},"CAMERE SINGOLE",{"$f":"+'3) INPUT VENDITE'!AD20","v":0},{"$f":"+'3) INPUT VENDITE'!AE20","v":0},{"$f":"+'3) INPUT VENDITE'!AF20","v":0},{"$f":"+'3) INPUT VENDITE'!AG20","v":0},{"$f":"+'3) INPUT VENDITE'!AH20","v":0},{"$f":"+'3) INPUT VENDITE'!AI20","v":0},{"$f":"+'3) INPUT VENDITE'!AJ20","v":0},{"$f":"+'3) INPUT VENDITE'!AK20","v":0},{"$f":"+'3) INPUT VENDITE'!AL20","v":0},{"$f":"+'3) INPUT VENDITE'!AM20","v":0},{"$f":"+'3) INPUT VENDITE'!AN20","v":0},{"$f":"+'3) INPUT VENDITE'!AO20","v":0},{"$f":"+'3) INPUT VENDITE'!AP20","v":0}]
[null,{"$f":"+'3) INPUT VENDITE'!A21","v":"VISITE GUIDATE"},{"$f":"+'3) INPUT VENDITE'!B21","v":0},{"$f":"+'3) INPUT VENDITE'!C21","v":0},{"$f":"+'3) INPUT VENDITE'!D21","v":0},{"$f":"+'3) INPUT VENDITE'!E21","v":0},{"$f":"+'3) INPUT VENDITE'!F21","v":0},{"$f":"+'3) INPUT VENDITE'!G21","v":0},{"$f":"+'3) INPUT VENDITE'!H21","v":0},{"$f":"+'3) INPUT VENDITE'!I21","v":0},{"$f":"+'3) INPUT VENDITE'!J21","v":0},{"$f":"+'3) INPUT VENDITE'!K21","v":0},{"$f":"+'3) INPUT VENDITE'!L21","v":0},{"$f":"+'3) INPUT VENDITE'!M21","v":0},{"$f":"+'3) INPUT VENDITE'!N21","v":0},{"$f":"+'3) INPUT VENDITE'!O21","v":0},"VISITE GUIDATE",{"$f":"+'3) INPUT VENDITE'!P21","v":0},{"$f":"+'3) INPUT VENDITE'!Q21","v":0},{"$f":"+'3) INPUT VENDITE'!R21","v":0},{"$f":"+'3) INPUT VENDITE'!S21","v":0},{"$f":"+'3) INPUT VENDITE'!T21","v":0},{"$f":"+'3) INPUT VENDITE'!U21","v":0},{"$f":"+'3) INPUT VENDITE'!V21","v":0},{"$f":"+'3) INPUT VENDITE'!W21","v":0},{"$f":"+'3) INPUT VENDITE'!X21","v":0},{"$f":"+'3) INPUT VENDITE'!Y21","v":0},{"$f":"+'3) INPUT VENDITE'!Z21","v":0},{"$f":"+'3) INPUT VENDITE'!AA21","v":0},{"$f":"+'3) INPUT VENDITE'!AB21","v":0},{"$f":"+'3) INPUT VENDITE'!AC21","v":0},"VISITE GUIDATE",{"$f":"+'3) INPUT VENDITE'!AD21","v":0},{"$f":"+'3) INPUT VENDITE'!AE21","v":0},{"$f":"+'3) INPUT VENDITE'!AF21","v":0},{"$f":"+'3) INPUT VENDITE'!AG21","v":0},{"$f":"+'3) INPUT VENDITE'!AH21","v":0},{"$f":"+'3) INPUT VENDITE'!AI21","v":0},{"$f":"+'3) INPUT VENDITE'!AJ21","v":0},{"$f":"+'3) INPUT VENDITE'!AK21","v":0},{"$f":"+'3) INPUT VENDITE'!AL21","v":0},{"$f":"+'3) INPUT VENDITE'!AM21","v":0},{"$f":"+'3) INPUT VENDITE'!AN21","v":0},{"$f":"+'3) INPUT VENDITE'!AO21","v":0},{"$f":"+'3) INPUT VENDITE'!AP21","v":0}]
[null,{"$f":"+'3) INPUT VENDITE'!A22","v":"Altri ricavi"},{"$f":"+'3) INPUT VENDITE'!B22","v":0},{"$f":"+'3) INPUT VENDITE'!C22","v":0},{"$f":"+'3) INPUT VENDITE'!D22","v":0},{"$f":"+'3) INPUT VENDITE'!E22","v":0},{"$f":"+'3) INPUT VENDITE'!F22","v":0},{"$f":"+'3) INPUT VENDITE'!G22","v":0},{"$f":"+'3) INPUT VENDITE'!H22","v":0},{"$f":"+'3) INPUT VENDITE'!I22","v":0},{"$f":"+'3) INPUT VENDITE'!J22","v":0},{"$f":"+'3) INPUT VENDITE'!K22","v":0},{"$f":"+'3) INPUT VENDITE'!L22","v":0},{"$f":"+'3) INPUT VENDITE'!M22","v":0},{"$f":"+'3) INPUT VENDITE'!N22","v":0},{"$f":"+'3) INPUT VENDITE'!O22","v":0},"Altri ricavi",{"$f":"+'3) INPUT VENDITE'!P22","v":0},{"$f":"+'3) INPUT VENDITE'!Q22","v":0},{"$f":"+'3) INPUT VENDITE'!R22","v":0},{"$f":"+'3) INPUT VENDITE'!S22","v":0},{"$f":"+'3) INPUT VENDITE'!T22","v":0},{"$f":"+'3) INPUT VENDITE'!U22","v":0},{"$f":"+'3) INPUT VENDITE'!V22","v":0},{"$f":"+'3) INPUT VENDITE'!W22","v":0},{"$f":"+'3) INPUT VENDITE'!X22","v":0},{"$f":"+'3) INPUT VENDITE'!Y22","v":0},{"$f":"+'3) INPUT VENDITE'!Z22","v":0},{"$f":"+'3) INPUT VENDITE'!AA22","v":0},{"$f":"+'3) INPUT VENDITE'!AB22","v":0},{"$f":"+'3) INPUT VENDITE'!AC22","v":0},"Altri ricavi",{"$f":"+'3) INPUT VENDITE'!AD22","v":0},{"$f":"+'3) INPUT VENDITE'!AE22","v":0},{"$f":"+'3) INPUT VENDITE'!AF22","v":0},{"$f":"+'3) INPUT VENDITE'!AG22","v":0},{"$f":"+'3) INPUT VENDITE'!AH22","v":0},{"$f":"+'3) INPUT VENDITE'!AI22","v":0},{"$f":"+'3) INPUT VENDITE'!AJ22","v":0},{"$f":"+'3) INPUT VENDITE'!AK22","v":0},{"$f":"+'3) INPUT VENDITE'!AL22","v":0},{"$f":"+'3) INPUT VENDITE'!AM22","v":0},{"$f":"+'3) INPUT VENDITE'!AN22","v":0},{"$f":"+'3) INPUT VENDITE'!AO22","v":0},{"$f":"+'3) INPUT VENDITE'!AP22","v":0}]
[null,{"$f":"+'3) INPUT VENDITE'!A23","v":"Altri ricavi"},{"$f":"+'3) INPUT VENDITE'!B23","v":0},{"$f":"+'3) INPUT VENDITE'!C23","v":0},{"$f":"+'3) INPUT VENDITE'!D23","v":0},{"$f":"+'3) INPUT VENDITE'!E23","v":0},{"$f":"+'3) INPUT VENDITE'!F23","v":0},{"$f":"+'3) INPUT VENDITE'!G23","v":0},{"$f":"+'3) INPUT VENDITE'!H23","v":0},{"$f":"+'3) INPUT VENDITE'!I23","v":0},{"$f":"+'3) INPUT VENDITE'!J23","v":0},{"$f":"+'3) INPUT VENDITE'!K23","v":0},{"$f":"+'3) INPUT VENDITE'!L23","v":0},{"$f":"+'3) INPUT VENDITE'!M23","v":0},{"$f":"+'3) INPUT VENDITE'!N23","v":0},{"$f":"+'3) INPUT VENDITE'!O23","v":0},"Altri ricavi",{"$f":"+'3) INPUT VENDITE'!P23","v":0},{"$f":"+'3) INPUT VENDITE'!Q23","v":0},{"$f":"+'3) INPUT VENDITE'!R23","v":0},{"$f":"+'3) INPUT VENDITE'!S23","v":0},{"$f":"+'3) INPUT VENDITE'!T23","v":0},{"$f":"+'3) INPUT VENDITE'!U23","v":0},{"$f":"+'3) INPUT VENDITE'!V23","v":0},{"$f":"+'3) INPUT VENDITE'!W23","v":0},{"$f":"+'3) INPUT VENDITE'!X23","v":0},{"$f":"+'3) INPUT VENDITE'!Y23","v":0},{"$f":"+'3) INPUT VENDITE'!Z23","v":0},{"$f":"+'3) INPUT VENDITE'!AA23","v":0},{"$f":"+'3) INPUT VENDITE'!AB23","v":0},{"$f":"+'3) INPUT VENDITE'!AC23","v":0},"Altri ricavi",{"$f":"+'3) INPUT VENDITE'!AD23","v":0},{"$f":"+'3) INPUT VENDITE'!AE23","v":0},{"$f":"+'3) INPUT VENDITE'!AF23","v":0},{"$f":"+'3) INPUT VENDITE'!AG23","v":0},{"$f":"+'3) INPUT VENDITE'!AH23","v":0},{"$f":"+'3) INPUT VENDITE'!AI23","v":0},{"$f":"+'3) INPUT VENDITE'!AJ23","v":0},{"$f":"+'3) INPUT VENDITE'!AK23","v":0},{"$f":"+'3) INPUT VENDITE'!AL23","v":0},{"$f":"+'3) INPUT VENDITE'!AM23","v":0},{"$f":"+'3) INPUT VENDITE'!AN23","v":0},{"$f":"+'3) INPUT VENDITE'!AO23","v":0},{"$f":"+'3) INPUT VENDITE'!AP23","v":0}]
[null,{"$f":"+'3) INPUT VENDITE'!A24","v":"Altri ricavi"},{"$f":"+'3) INPUT VENDITE'!B24","v":0},{"$f":"+'3) INPUT VENDITE'!C24","v":0},{"$f":"+'3) INPUT VENDITE'!D24","v":0},{"$f":"+'3) INPUT VENDITE'!E24","v":0},{"$f":"+'3) INPUT VENDITE'!F24","v":0},{"$f":"+'3) INPUT VENDITE'!G24","v":0},{"$f":"+'3) INPUT VENDITE'!H24","v":0},{"$f":"+'3) INPUT VENDITE'!I24","v":0},{"$f":"+'3) INPUT VENDITE'!J24","v":0},{"$f":"+'3) INPUT VENDITE'!K24","v":0},{"$f":"+'3) INPUT VENDITE'!L24","v":0},{"$f":"+'3) INPUT VENDITE'!M24","v":0},{"$f":"+'3) INPUT VENDITE'!N24","v":0},{"$f":"+'3) INPUT VENDITE'!O24","v":0},"Altri ricavi",{"$f":"+'3) INPUT VENDITE'!P24","v":0},{"$f":"+'3) INPUT VENDITE'!Q24","v":0},{"$f":"+'3) INPUT VENDITE'!R24","v":0},{"$f":"+'3) INPUT VENDITE'!S24","v":0},{"$f":"+'3) INPUT VENDITE'!T24","v":0},{"$f":"+'3) INPUT VENDITE'!U24","v":0},{"$f":"+'3) INPUT VENDITE'!V24","v":0},{"$f":"+'3) INPUT VENDITE'!W24","v":0},{"$f":"+'3) INPUT VENDITE'!X24","v":0},{"$f":"+'3) INPUT VENDITE'!Y24","v":0},{"$f":"+'3) INPUT VENDITE'!Z24","v":0},{"$f":"+'3) INPUT VENDITE'!AA24","v":0},{"$f":"+'3) INPUT VENDITE'!AB24","v":0},{"$f":"+'3) INPUT VENDITE'!AC24","v":0},"Altri ricavi",{"$f":"+'3) INPUT VENDITE'!AD24","v":0},{"$f":"+'3) INPUT VENDITE'!AE24","v":0},{"$f":"+'3) INPUT VENDITE'!AF24","v":0},{"$f":"+'3) INPUT VENDITE'!AG24","v":0},{"$f":"+'3) INPUT VENDITE'!AH24","v":0},{"$f":"+'3) INPUT VENDITE'!AI24","v":0},{"$f":"+'3) INPUT VENDITE'!AJ24","v":0},{"$f":"+'3) INPUT VENDITE'!AK24","v":0},{"$f":"+'3) INPUT VENDITE'!AL24","v":0},{"$f":"+'3) INPUT VENDITE'!AM24","v":0},{"$f":"+'3) INPUT VENDITE'!AN24","v":0},{"$f":"+'3) INPUT VENDITE'!AO24","v":0},{"$f":"+'3) INPUT VENDITE'!AP24","v":0}]
[null,{"$f":"+'3) INPUT VENDITE'!A25","v":"Altri ricavi"},{"$f":"+'3) INPUT VENDITE'!B25","v":0},{"$f":"+'3) INPUT VENDITE'!C25","v":0},{"$f":"+'3) INPUT VENDITE'!D25","v":0},{"$f":"+'3) INPUT VENDITE'!E25","v":0},{"$f":"+'3) INPUT VENDITE'!F25","v":0},{"$f":"+'3) INPUT VENDITE'!G25","v":0},{"$f":"+'3) INPUT VENDITE'!H25","v":0},{"$f":"+'3) INPUT VENDITE'!I25","v":0},{"$f":"+'3) INPUT VENDITE'!J25","v":0},{"$f":"+'3) INPUT VENDITE'!K25","v":0},{"$f":"+'3) INPUT VENDITE'!L25","v":0},{"$f":"+'3) INPUT VENDITE'!M25","v":0},{"$f":"+'3) INPUT VENDITE'!N25","v":0},{"$f":"+'3) INPUT VENDITE'!O25","v":0},"Altri ricavi",{"$f":"+'3) INPUT VENDITE'!P25","v":0},{"$f":"+'3) INPUT VENDITE'!Q25","v":0},{"$f":"+'3) INPUT VENDITE'!R25","v":0},{"$f":"+'3) INPUT VENDITE'!S25","v":0},{"$f":"+'3) INPUT VENDITE'!T25","v":0},{"$f":"+'3) INPUT VENDITE'!U25","v":0},{"$f":"+'3) INPUT VENDITE'!V25","v":0},{"$f":"+'3) INPUT VENDITE'!W25","v":0},{"$f":"+'3) INPUT VENDITE'!X25","v":0},{"$f":"+'3) INPUT VENDITE'!Y25","v":0},{"$f":"+'3) INPUT VENDITE'!Z25","v":0},{"$f":"+'3) INPUT VENDITE'!AA25","v":0},{"$f":"+'3) INPUT VENDITE'!AB25","v":0},{"$f":"+'3) INPUT VENDITE'!AC25","v":0},"Altri ricavi",{"$f":"+'3) INPUT VENDITE'!AD25","v":0},{"$f":"+'3) INPUT VENDITE'!AE25","v":0},{"$f":"+'3) INPUT VENDITE'!AF25","v":0},{"$f":"+'3) INPUT VENDITE'!AG25","v":0},{"$f":"+'3) INPUT VENDITE'!AH25","v":0},{"$f":"+'3) INPUT VENDITE'!AI25","v":0},{"$f":"+'3) INPUT VENDITE'!AJ25","v":0},{"$f":"+'3) INPUT VENDITE'!AK25","v":0},{"$f":"+'3) INPUT VENDITE'!AL25","v":0},{"$f":"+'3) INPUT VENDITE'!AM25","v":0},{"$f":"+'3) INPUT VENDITE'!AN25","v":0},{"$f":"+'3) INPUT VENDITE'!AO25","v":0},{"$f":"+'3) INPUT VENDITE'!AP25","v":0}]
[null,{"$f":"+'3) INPUT VENDITE'!A26","v":"Altri ricavi"},{"$f":"+'3) INPUT VENDITE'!B26","v":0},{"$f":"+'3) INPUT VENDITE'!C26","v":0},{"$f":"+'3) INPUT VENDITE'!D26","v":0},{"$f":"+'3) INPUT VENDITE'!E26","v":0},{"$f":"+'3) INPUT VENDITE'!F26","v":0},{"$f":"+'3) INPUT VENDITE'!G26","v":0},{"$f":"+'3) INPUT VENDITE'!H26","v":0},{"$f":"+'3) INPUT VENDITE'!I26","v":0},{"$f":"+'3) INPUT VENDITE'!J26","v":0},{"$f":"+'3) INPUT VENDITE'!K26","v":0},{"$f":"+'3) INPUT VENDITE'!L26","v":0},{"$f":"+'3) INPUT VENDITE'!M26","v":0},{"$f":"+'3) INPUT VENDITE'!N26","v":0},{"$f":"+'3) INPUT VENDITE'!O26","v":0},"Altri ricavi",{"$f":"+'3) INPUT VENDITE'!P26","v":0},{"$f":"+'3) INPUT VENDITE'!Q26","v":0},{"$f":"+'3) INPUT VENDITE'!R26","v":0},{"$f":"+'3) INPUT VENDITE'!S26","v":0},{"$f":"+'3) INPUT VENDITE'!T26","v":0},{"$f":"+'3) INPUT VENDITE'!U26","v":0},{"$f":"+'3) INPUT VENDITE'!V26","v":0},{"$f":"+'3) INPUT VENDITE'!W26","v":0},{"$f":"+'3) INPUT VENDITE'!X26","v":0},{"$f":"+'3) INPUT VENDITE'!Y26","v":0},{"$f":"+'3) INPUT VENDITE'!Z26","v":0},{"$f":"+'3) INPUT VENDITE'!AA26","v":0},{"$f":"+'3) INPUT VENDITE'!AB26","v":0},{"$f":"+'3) INPUT VENDITE'!AC26","v":0},"Altri ricavi",{"$f":"+'3) INPUT VENDITE'!AD26","v":0},{"$f":"+'3) INPUT VENDITE'!AE26","v":0},{"$f":"+'3) INPUT VENDITE'!AF26","v":0},{"$f":"+'3) INPUT VENDITE'!AG26","v":0},{"$f":"+'3) INPUT VENDITE'!AH26","v":0},{"$f":"+'3) INPUT VENDITE'!AI26","v":0},{"$f":"+'3) INPUT VENDITE'!AJ26","v":0},{"$f":"+'3) INPUT VENDITE'!AK26","v":0},{"$f":"+'3) INPUT VENDITE'!AL26","v":0},{"$f":"+'3) INPUT VENDITE'!AM26","v":0},{"$f":"+'3) INPUT VENDITE'!AN26","v":0},{"$f":"+'3) INPUT VENDITE'!AO26","v":0},{"$f":"+'3) INPUT VENDITE'!AP26","v":0}]
[null,{"$f":"+B68","v":"TOTALE CAMERE"},{"$f":"SUM(C71:C80)","v":12},{"$f":"SUM(D71:D80)","v":31},54,55.800000000000004,55.800000000000004,30,12.4,12,55.800000000000004,12.4,11.200000000000001,12.4,{"$f":"SUM(C81:N81)","v":354.79999999999995},null,"TOTALE CAMERE",{"$f":"+R71+R72+R73+R74","v":12},{"$f":"+S71+S72+S73+S74","v":31},54,55.800000000000004,55.800000000000004,30,12.4,12,55.800000000000004,12.4,11.200000000000001,12.4,{"$f":"SUM(R81:AC81)","v":354.79999999999995},null,"TOTALE CAMERE",{"$f":"+AG71+AG72+AG73+AG74","v":12},{"$f":"+AH71+AH72+AH73+AH74","v":31},54,55.800000000000004,55.800000000000004,30,12.4,12,55.800000000000004,12.4,11.200000000000001,12.4,{"$f":"SUM(AG81:AR81)","v":354.79999999999995}]
[null,null,"MESI",null,null,null,null,null,null,null,null,null,null,null,"ANNO 1",null,null,"MESI",null,null,null,null,null,null,null,null,null,null,null,"ANNO 2",null,null,"MESI",null,null,null,null,null,null,null,null,null,null,null,"ANNO 3"]
[null,"N. PRESENZE",{"$f":"+C70","v":"2016-04-30"},{"$f":"+EOMONTH(C83,1)","v":"2016-05-31"},{"$f":"+EOMONTH(D83,1)","v":"2016-06-30"},{"$f":"+EOMONTH(E83,1)","v":"2016-07-31"},{"$f":"+EOMONTH(F83,1)","v":"2016-08-31"},{"$f":"+EOMONTH(G83,1)","v":"2016-09-30"},{"$f":"+EOMONTH(H83,1)","v":"2016-10-31"},{"$f":"+EOMONTH(I83,1)","v":"2016-11-30"},{"$f":"+EOMONTH(J83,1)","v":"2016-12-31"},{"$f":"+EOMONTH(K83,1)","v":"2017-01-31"},{"$f":"+EOMONTH(L83,1)","v":"2017-02-28"},{"$f":"+EOMONTH(M83,1)","v":"2017-03-31"},"TOTALE","IPOTESI %",{"$f":"+B83","v":"N. PRESENZE"},{"$f":"+EOMONTH(N83,1)","v":"2017-04-30"},{"$f":"+EOMONTH(R83,1)","v":"2017-05-31"},{"$f":"+EOMONTH(S83,1)","v":"2017-06-30"},{"$f":"+EOMONTH(T83,1)","v":"2017-07-31"},{"$f":"+EOMONTH(U83,1)","v":"2017-08-31"},{"$f":"+EOMONTH(V83,1)","v":"2017-09-30"},{"$f":"+EOMONTH(W83,1)","v":"2017-10-31"},{"$f":"+EOMONTH(X83,1)","v":"2017-11-30"},{"$f":"+EOMONTH(Y83,1)","v":"2017-12-31"},{"$f":"+EOMONTH(Z83,1)","v":"2018-01-31"},{"$f":"+EOMONTH(AA83,1)","v":"2018-02-28"},{"$f":"+EOMONTH(AB83,1)","v":"2018-03-31"},"TOTALE","IPOTESI %",{"$f":"+Q83","v":"N. PRESENZE"},{"$f":"+EOMONTH(AC83,1)","v":"2018-04-30"},{"$f":"+EOMONTH(AG83,1)","v":"2018-05-31"},{"$f":"+EOMONTH(AH83,1)","v":"2018-06-30"},{"$f":"+EOMONTH(AI83,1)","v":"2018-07-31"},{"$f":"+EOMONTH(AJ83,1)","v":"2018-08-31"},{"$f":"+EOMONTH(AK83,1)","v":"2018-09-30"},{"$f":"+EOMONTH(AL83,1)","v":"2018-10-31"},{"$f":"+EOMONTH(AM83,1)","v":"2018-11-30"},{"$f":"+EOMONTH(AN83,1)","v":"2018-12-31"},{"$f":"+EOMONTH(AO83,1)","v":"2019-01-31"},{"$f":"+EOMONTH(AP83,1)","v":"2019-02-28"},{"$f":"+EOMONTH(AQ83,1)","v":"2019-03-31"},"TOTALE"]
[null,{"$f":"+B71","v":"CAMERE QUADRUPLE"},{"$f":"+C71*4","v":0},{"$f":"+D71*4","v":0},0,0,0,0,0,0,0,0,0,0,0,0,{"$f":"+B84","v":"CAMERE QUADRUPLE"},0,0,0,0,0,0,0,0,0,0,0,0,0,0,{"$f":"+Q84","v":"CAMERE QUADRUPLE"},{"$f":"+AG71*4","v":0},0,0,0,0,0,0,0,0,0,0,0,0]
[null,{"$f":"+B72","v":"CAMERE TRIPLE"},{"$f":"+C72*3","v":0},{"$f":"+D72*3","v":0},0,0,0,0,0,0,0,0,0,0,0,0,{"$f":"+B85","v":"CAMERE TRIPLE"},0,0,0,0,0,0,0,0,0,0,0,0,0,0,{"$f":"+Q85","v":"CAMERE TRIPLE"},{"$f":"+AG72*3","v":0},0,0,0,0,0,0,0,0,0,0,0,0]
[null,"CAMERE DOPPIE",{"$f":"+C73*2","v":24},{"$f":"+D73*2","v":62},108,111.60000000000001,111.60000000000001,60,24.8,24,111.60000000000001,24.8,22.400000000000002,24.8,709.59999999999991,0,"CAMERE DOPPIE",24,62,108,111.60000000000001,111.60000000000001,60,24.8,24,111.60000000000001,24.8,22.400000000000002,24.8,709.59999999999991,0,"CAMERE DOPPIE",{"$f":"+AG73*2","v":24},{"$f":"+AH73*2","v":62},108,111.60000000000001,111.60000000000001,60,24.8,24,111.60000000000001,24.8,22.400000000000002,24.8,709.59999999999991]
[null,"CAMERE SINGOLE",{"$f":"+C74","v":0},{"$f":"+D74","v":0},0,0,0,0,0,0,0,0,0,0,0,0,"CAMERE SINGOLE",0,0,0,0,0,0,0,0,0,0,0,0,0,0,"CAMERE SINGOLE",{"$f":"+AG74","v":0},0,0,0,0,0,0,0,0,0,0,0,0]
[null,{"$f":"+B81","v":"TOTALE CAMERE"},{"$f":"SUM(C84:C87)","v":24},{"$f":"SUM(D84:D87)","v":62},108,111.60000000000001,111.60000000000001,60,24.8,24,111.60000000000001,24.8,22.400000000000002,{"$f":"SUM(N84:N87)","v":24.8},{"$f":"SUM(C88:N88)","v":709.59999999999991},null,"TOTALE CAMERE",{"$f":"SUM(R84:R87)","v":24},{"$f":"SUM(S84:S87)","v":62},108,111.60000000000001,111.60000000000001,60,24.8,24,111.60000000000001,24.8,22.400000000000002,24.8,{"$f":"SUM(R88:AC88)","v":709.59999999999991},null,"TOTALE CAMERE",{"$f":"SUM(AG84:AG87)","v":24},{"$f":"SUM(AH84:AH87)","v":62},108,111.60000000000001,111.60000000000001,60,24.8,24,111.60000000000001,24.8,22.400000000000002,24.8,{"$f":"SUM(AG88:AR88)","v":709.59999999999991}]

{"sheet":"7) INPUT FINANZIAMENTO","index":6,"n_rows":387,"n_cols":14,"rows_kept":387,"cut":false,"hidden":false,"merged":[[12,0,12,1]]}
["INPUT FINANZIAMENTI","mese 1","ANNO 1","% su entrate","ANNO 2",{"$f":"+D1","v":"% su entrate"},"ANNO 3",{"$f":"+F1","v":"% su entrate"}]
["TOTALE ENTRATE",{"$f":"+'3) INPUT VENDITE'!B14","v":600},{"$f":"+'3) INPUT VENDITE'!N14","v":27816},{"$f":"+C2/$C$2","v":1},{"$f":"+'3) INPUT VENDITE'!AB14","v":27816},{"$f":"+E2/$E$2","v":1},{"$f":"+'3) INPUT VENDITE'!AP14","v":27816},{"$f":"+G2/$G$2","v":1}]
["TOTALE INVESTIMENTI",{"$f":"+'2) INPUT INVESTIMENTI'!D58","v":7600},{"$f":"+'2) INPUT INVESTIMENTI'!E59","v":7600},{"$f":"+C3/$C$2","v":0.27322404371584702},{"$f":"+'2) INPUT INVESTIMENTI'!I59","v":0},{"$f":"+E3/$E$2","v":0},{"$f":"+'2) INPUT INVESTIMENTI'!M59","v":0},{"$f":"+G3/$G$2","v":0}]
["TOTALE USCITE FISSE",{"$f":"+'5) INPUT COSTI FISSI'!B36","v":530},{"$f":"+'5) INPUT COSTI FISSI'!N36","v":4920},{"$f":"+C4/$C$2","v":0.17687661777394306},{"$f":"+'5) INPUT COSTI FISSI'!AB36","v":4920},{"$f":"+E4/$E$2","v":0.17687661777394306},{"$f":"+'5) INPUT COSTI FISSI'!AP36","v":4920},{"$f":"+G4/$G$2","v":0.17687661777394306}]
["TOTALE USCITE VARIABILI",{"$f":"+'6) INPUT COSTI VARIABILI'!C55","v":78},{"$f":"+'6) INPUT COSTI VARIABILI'!O55","v":3011.52},{"$f":"+C5/$C$2","v":0.10826574633304573},{"$f":"+'6) INPUT COSTI VARIABILI'!AD55","v":3011.52},{"$f":"+E5/$E$2","v":0.10826574633304573},{"$f":"+'6) INPUT COSTI VARIABILI'!AS55","v":3011.52},{"$f":"+G5/$G$2","v":0.10826574633304573}]
[]
["CASH FLOW UNLEVERED",{"$f":"+B2-B3-B4-B5","v":-7608},{"$f":"+C2-C3-C4-C5","v":12284.48},null,{"$f":"+E2-E3-E4-E5","v":19884.48},null,{"$f":"+G2-G3-G4-G5","v":19884.48}]
[]
["Data versamento/finanziamento",{"$f":"+'5) INPUT COSTI FISSI'!B2","v":"2016-04-30"}]
["Versamento capitale",{"$f":"IF(-B7-B11<0,0,-B7-B11)","v":0}]
["Finanziamento terzi",10000]
[]
["INPUT FINANZIAMENTO"]
["capitale",{"$f":"+B11","v":10000}]
["data stipula",{"$f":"+B9","v":"2016-04-30"}]
["periodicità","mensile",null,null,null,null,null,null,null,null,null,null,{"$f":"+IF(B16=\"mensile\",1,IF(B16=\"trimestrale\",3,IF(B16=\"semestrale\",6,0)))","v":1},{"$f":"12/M16","v":12}]
["data prima rata",{"$f":"+EOMONTH(B15,M16)","v":"2016-05-31"}]
["tan",0.03]
["tasso periodale",{"$f":"+B18/N16","v":2.5000000000000001E-3}]
["numero rate",30]
["spesa per rata",2.5]
["spese all'erogazione",300]
["Estinzione anticipata",0.01,"sul tot. rate residue"]
["DATA ESTINZIONE",null,null,null,null,null,null,null,null,"TEG",{"$f":"+XIRR(K27:K387,A27:A387,0)","v":8.6503100585937479E-2}]
[]
["DATA","N. RATA","QT. CAPITALE","QUOTA INT.","RATA","SPESE","PENALE ESTINZIONE","CAPITALE DA RESTITUIRE","DEBITO RESIDUO","TOT. RATE RESIDUE","FLUSSO",null,"rate"]
[{"$f":"+B15","v":"2016-04-30"},"EROGAZIONE",null,null,null,{"$f":"+B22","v":300},{"$f":"+IF(B27=\"ESTINZIONE\",IF($C$23=\"sul cap.residuo\",I27*$B$23,J27*$B$23),0)","v":0},{"$f":"+IF(B27=\"ESTINZIONE\",I27,0)","v":0},{"$f":"+B14","v":10000},{"$f":"+SUM(M28:M387)","v":10738.581877813904},{"$f":"+B14-F27","v":9700}]
[{"$f":"+B17","v":"2016-05-31"},1,{"$f":"+E28-D28","v":321.40586702625524},{"$f":"+I27*$B$19","v":25},{"$f":"IF(B28=0,0,-PMT(B19,B20,B14,0))","v":346.40586702625524},{"$f":"+B21","v":2.5},{"$f":"+IF(B28=\"ESTINZIONE\",IF($C$23=\"sul cap.residuo\",I28*$B$23,J28*$B$23),0)","v":0},{"$f":"IF(B28=0,0,IF(B28=\"ESTINZIONE\",I28,0))","v":0},{"$f":"IF(B30=0,0,I27-C28)","v":9678.5941329737452},{"$f":"+SUM(M29:M388)","v":10392.176010787649},{"$f":"-E28-F28-G28-H28","v":-348.90586702625524},null,{"$f":"IF(B28=0,0,$E$28)","v":346.40586702625524}]
[{"$f":"+EOMONTH(A28,$M$16)","v":"2016-06-30"},{"$f":"IF(B28=0,0,IF(B28>$B$20,0,IF(B28=\"ESTINZIONE\",0,IF(A29=$B$24,\"ESTINZIONE\",B28+1))))","v":2},{"$f":"IF(B29=0,0,E29-D29)","v":322.20938169382089},{"$f":"IF(B29=0,0,I28*$B$19)","v":24.196485332434364},{"$f":"+IF(B29=0,0,E28)","v":346.40586702625524},{"$f":"+IF(B29=0,0,F28)","v":2.5},0,0,{"$f":"IF(B31=0,0,I28-C29)","v":9356.3847512799239},10045.770143761394,-348.90586702625524,null,{"$f":"IF(B29=0,0,$E$28)","v":346.40586702625524}]
[{"$f":"+EOMONTH(A29,$M$16)","v":"2016-07-31"},{"$f":"IF(B29=0,0,IF(B29>$B$20,0,IF(B29=\"ESTINZIONE\",0,IF(A30=$B$24,\"ESTINZIONE\",B29+1))))","v":3},323.01490514805545,23.390961878199811,346.40586702625524,2.5,0,0,9033.3698461318691,9699.3642767351394,-348.90586702625524,null,346.40586702625524]
["2016-08-31",4,323.82244241092559,22.583424615329672,346.40586702625524,2.5,0,0,8709.5474037209442,9352.9584097088846,-348.90586702625524,null,346.40586702625524]
["2016-09-30",5,324.63199851695288,21.773868509302361,346.40586702625524,2.5,0,0,8384.9154052039921,9006.5525426826298,-348.90586702625524,null,346.40586702625524]
["2016-10-31",6,325.44357851324526,20.96228851300998,346.40586702625524,2.5,0,0,8059.4718266907466,8660.146675656375,-348.90586702625524,null,346.40586702625524]
["2016-11-30",7,326.25718745952838,20.148679566726866,346.40586702625524,2.5,0,0,7733.2146392312179,8313.7408086301202,-348.90586702625524,null,346.40586702625524]
["2016-12-31",8,327.07283042817721,19.333036598078046,346.40586702625524,2.5,0,0,7406.1418088030405,7967.3349416038654,-348.90586702625524,null,346.40586702625524]
["2017-01-31",9,327.89051250424762,18.515354522007602,346.40586702625524,2.5,0,0,7078.251296298793,7620.9290745776107,-348.90586702625524,null,346.40586702625524]
["2017-02-28",10,328.71023878550824,17.695628240746984,346.40586702625524,2.5,0,0,6749.5410575132846,7274.5232075513559,-348.90586702625524,null,346.40586702625524]
["2017-03-31",11,329.53201438247203,16.873852643783213,346.40586702625524,2.5,0,0,6420.0090431308126,6928.1173405251011,-348.90586702625524,null,346.40586702625524]
["2017-04-30",12,330.35584441842821,16.050022607827032,346.40586702625524,2.5,0,0,6089.6531987123844,6581.7114734988463,-348.90586702625524,null,346.40586702625524]
["2017-05-31",13,331.18173402947428,15.224132996780961,346.40586702625524,2.5,0,0,5758.4714646829098,6235.3056064725915,-348.90586702625524,null,346.40586702625524]
["2017-06-30",14,332.00968836454797,14.396178661707275,346.40586702625524,2.5,0,0,5426.4617763183614,5888.8997394463368,-348.90586702625524,null,346.40586702625524]
["2017-07-31",15,332.83971258545932,13.566154440795904,346.40586702625524,2.5,0,0,5093.6220637329025,5542.493872420082,-348.90586702625524,null,346.40586702625524]
["2017-08-31",16,333.67181186692301,12.734055159332257,346.40586702625524,2.5,0,0,4759.9502518659792,5196.0880053938272,-348.90586702625524,null,346.40586702625524]
["2017-09-30",17,334.50599139659028,11.899875629664947,346.40586702625524,2.5,0,0,4425.4442604693886,4849.6821383675724,-348.90586702625524,null,346.40586702625524]
["2017-10-31",18,335.34225637508177,11.063610651173471,346.40586702625524,2.5,0,0,4090.1020040943067,4503.2762713413176,-348.90586702625524,null,346.40586702625524]
["2017-11-30",19,336.1806120160195,10.225255010235767,346.40586702625524,2.5,0,0,3753.9213920782872,4156.8704043150628,-348.90586702625524,null,346.40586702625524]
["2017-12-31",20,337.02106354605951,9.3848034801957176,346.40586702625524,2.5,0,0,3416.9003285322278,3810.4645372888076,-348.90586702625524,null,346.40586702625524]
["2018-01-31",21,337.86361620492465,8.542250821330569,346.40586702625524,2.5,0,0,3079.0367123273031,3464.0586702625524,-348.90586702625524,null,346.40586702625524]
["2018-02-28",22,338.70827524543699,7.6975917808182581,346.40586702625524,2.5,0,0,2740.328437081866,3117.6528032362971,-348.90586702625524,null,346.40586702625524]
["2018-03-31",23,339.55504593355056,6.8508210927046651,346.40586702625524,2.5,0,0,2400.7733911483156,2771.2469362100419,-348.90586702625524,null,346.40586702625524]
["2018-04-30",24,340.40393354838443,6.0019334778707893,346.40586702625524,2.5,0,0,2060.3694575999311,2424.8410691837867,-348.90586702625524,null,346.40586702625524]
["2018-05-31",25,341.25494338225542,5.1509236439998283,346.40586702625524,2.5,0,0,1719.1145142176756,2078.4352021575314,-348.90586702625524,null,346.40586702625524]
["2018-06-30",26,342.10808074071105,4.2977862855441895,346.40586702625524,2.5,0,0,1377.0064334769645,1732.0293351312762,-348.90586702625524,null,346.40586702625524]
["2018-07-31",27,342.96335094256284,3.4425160836924111,346.40586702625524,2.5,0,0,1034.0430825344017,1385.6234681050209,-348.90586702625524,null,346.40586702625524]
["2018-08-31",28,343.8207593199192,2.5851077063360042,346.40586702625524,2.5,0,0,690.22232321448246,1039.2176010787657,-348.90586702625524,null,346.40586702625524]
["2018-09-30",29,344.680311218219,1.7255558080362061,346.40586702625524,2.5,0,0,345.54201199626345,692.81173405251047,-348.90586702625524,null,346.40586702625524]
["2018-10-31",30,345.54201199626459,0.86385502999065866,346.40586702625524,2.5,0,0,0,346.40586702625524,-348.90586702625524,null,346.40586702625524]
["2018-11-30",31,346.40586702625524,0,346.40586702625524,2.5,0,0,0,0,-348.90586702625524,null,346.40586702625524]
["2018-12-31",0,0,0,0,0,0,0,0,0,0,null,0]
["2019-01-31",0,0,0,0,0,0,{"$f":"IF(B60=0,0,IF(B60=\"ESTINZIONE\",I60,0))","v":0},0,0,{"$f":"-E60-F60-G60-H60","v":0},null,0]
["2019-02-28",0,{"$f":"IF(B61=0,0,E61-D61)","v":0},0,{"$f":"+IF(B61=0,0,E60)","v":0},{"$f":"+IF(B61=0,0,F60)","v":0},0,0,0,0,0,null,0]
["2019-03-31",0,0,0,0,0,0,0,0,0,0,null,0]
["2019-04-30",0,0,0,0,0,0,0,0,0,0,null,0]
["2019-05-31",0,0,0,0,0,0,0,0,0,0,null,0]
["2019-06-30",0,0,0,0,0,0,0,0,0,0,null,0]
["2019-07-31",0,0,0,0,0,0,0,0,0,0,null,0]
["2019-08-31",0,0,0,0,0,0,0,0,0,0,null,0]
["2019-09-30",0,0,0,0,0,0,0,0,0,0,null,0]
["2019-10-31",0,0,0,0,0,0,0,0,0,0,null,0]
["2019-11-30",0,0,0,0,0,0,0,0,0,0,null,0]
["2019-12-31",0,0,0,0,0,0,0,0,0,0,null,0]
["2020-01-31",0,0,0,0,0,0,0,0,0,0,null,0]
["2020-02-29",0,0,0,0,0,0,0,0,0,0,null,0]
["2020-03-31",0,0,0,0,0,0,0,0,0,0,null,0]
["2020-04-30",0,0,0,0,0,0,0,0,0,0,null,0]
["2020-05-31",0,0,0,0,0,0,0,0,0,0,null,0]
["2020-06-30",0,0,0,0,0,0,0,0,0,0,null,0]
["2020-07-31",0,0,0,0,0,0,0,0,0,0,null,0]
["2020-08-31",0,0,0,0,0,0,0,0,0,0,null,0]
["2020-09-30",0,0,0,0,0,0,0,0,0,0,null,0]
["2020-10-31",0,0,0,0,0,0,0,0,0,0,null,0]
["2020-11-30",0,0,0,0,0,0,0,0,0,0,null,0]
["2020-12-31",0,0,0,0,0,0,0,0,0,0,null,0]
["2021-01-31",0,0,0,0,0,0,0,0,0,0,null,0]
["2021-02-28",0,0,0,0,0,0,0,0,0,0,null,0]
["2021-03-31",0,0,0,0,0,0,0,0,0,0,null,0]
["2021-04-30",0,0,0,0,0,0,0,0,0,0,null,0]
["2021-05-31",0,0,0,0,0,0,0,0,0,0,null,0]
["2021-06-30",0,0,0,0,0,0,0,0,0,0,null,0]
["2021-07-31",0,0,0,0,0,0,0,0,0,0,null,0]
["2021-08-31",0,0,0,0,0,0,0,0,0,0,null,0]
["2021-09-30",0,0,0,0,0,{"$f":"+IF(B92=\"ESTINZIONE\",IF($C$23=\"sul cap.residuo\",I92*$B$23,J92*$B$23),0)","v":0},{"$f":"IF(B92=0,0,IF(B92=\"ESTINZIONE\",I92,0))","v":0},0,{"$f":"+SUM(M93:M452)","v":0},{"$f":"-E92-F92-G92-H92","v":0},null,0]
["2021-10-31",0,{"$f":"IF(B93=0,0,E93-D93)","v":0},{"$f":"IF(B93=0,0,I92*$B$19)","v":0},{"$f":"+IF(B93=0,0,E92)","v":0},{"$f":"+IF(B93=0,0,F92)","v":0},0,0,{"$f":"IF(B95=0,0,I92-C93)","v":0},0,0,null,{"$f":"IF(B93=0,0,$E$28)","v":0}]
[{"$f":"+EOMONTH(A93,$M$16)","v":"2021-11-30"},{"$f":"IF(B93=0,0,IF(B93>$B$20,0,IF(B93=\"ESTINZIONE\",0,IF(A94=$B$24,\"ESTINZIONE\",B93+1))))","v":0},0,0,0,0,0,0,0,0,0,null,0]
["2021-12-31",0,0,0,0,0,0,0,0,0,0,null,0]
["2022-01-31",0,0,0,0,0,0,0,0,0,0,null,0]
["2022-02-28",0,0,0,0,0,0,0,0,0,0,null,0]
["2022-03-31",0,0,0,0,0,0,0,0,0,0,null,0]
["2022-04-30",0,0,0,0,0,0,0,0,0,0,null,0]
["2022-05-31",0,0,0,0,0,0,0,0,0,0,null,0]
["2022-06-30",0,0,0,0,0,0,0,0,0,0,null,0]
["2022-07-31",0,0,0,0,0,0,0,0,0,0,null,0]
["2022-08-31",0,0,0,0,0,0,0,0,0,0,null,0]
["2022-09-30",0,0,0,0,0,0,0,0,0,0,null,0]
["2022-10-31",0,0,0,0,0,0,0,0,0,0,null,0]
["2022-11-30",0,0,0,0,0,0,0,0,0,0,null,0]
["2022-12-31",0,0,0,0,0,0,0,0,0,0,null,0]
["2023-01-31",0,0,0,0,0,0,0,0,0,0,null,0]
["2023-02-28",0,0,0,0,0,0,0,0,0,0,null,0]
["2023-03-31",0,0,0,0,0,0,0,0,0,0,null,0]
["2023-04-30",0,0,0,0,0,0,0,0,0,0,null,0]
["2023-05-31",0,0,0,0,0,0,0,0,0,0,null,0]
["2023-06-30",0,0,0,0,0,0,0,0,0,0,null,0]
["2023-07-31",0,0,0,0,0,0,0,0,0,0,null,0]
["2023-08-31",0,0,0,0,0,0,0,0,0,0,null,0]
["2023-09-30",0,0,0,0,0,0,0,0,0,0,null,0]
["2023-10-31",0,0,0,0,0,0,0,0,0,0,null,0]
["2023-11-30",0,0,0,0,0,0,0,0,0,0,null,0]
["2023-12-31",0,0,0,0,0,0,0,0,0,0,null,0]
["2024-01-31",0,0,0,0,0,0,0,0,0,0,null,0]
["2024-02-29",0,0,0,0,0,0,0,0,0,0,null,0]
["2024-03-31",0,0,0,0,0,0,0,0,0,0,null,0]
["2024-04-30",0,0,0,0,0,0,0,0,0,0,null,0]
["2024-05-31",0,0,0,0,0,0,{"$f":"IF(B124=0,0,IF(B124=\"ESTINZIONE\",I124,0))","v":0},0,0,{"$f":"-E124-F124-G124-H124","v":0},null,0]
["2024-06-30",0,{"$f":"IF(B125=0,0,E125-D125)","v":0},0,{"$f":"+IF(B125=0,0,E124)","v":0},{"$f":"+IF(B125=0,0,F124)","v":0},0,0,0,0,0,null,0]
["2024-07-31",0,0,0,0,0,0,0,0,0,0,null,0]
["2024-08-31",0,0,0,0,0,0,0,0,0,0,null,0]
["2024-09-30",0,0,0,0,0,0,0,0,0,0,null,0]
["2024-10-31",0,0,0,0,0,0,0,0,0,0,null,0]
["2024-11-30",0,0,0,0,0,0,0,0,0,0,null,0]
["2024-12-31",0,0,0,0,0,0,0,0,0,0,null,0]
["2025-01-31",0,0,0,0,0,0,0,0,0,0,null,0]
["2025-02-28",0,0,0,0,0,0,0,0,0,0,null,0]
["2025-03-31",0,0,0,0,0,0,0,0,0,0,null,0]
["2025-04-30",0,0,0,0,0,0,0,0,0,0,null,0]
["2025-05-31",0,0,0,0,0,0,0,0,0,0,null,0]
["2025-06-30",0,0,0,0,0,0,0,0,0,0,null,0]
["2025-07-31",0,0,0,0,0,0,0,0,0,0,null,0]
["2025-08-31",0,0,0,0,0,0,0,0,0,0,null,0]
["2025-09-30",0,0,0,0,0,0,0,0,0,0,null,0]
["2025-10-31",0,0,0,0,0,0,0,0,0,0,null,0]
["2025-11-30",0,0,0,0,0,0,0,0,0,0,null,0]
["2025-12-31",0,0,0,0,0,0,0,0,0,0,null,0]
["2026-01-31",0,0,0,0,0,0,0,0,0,0,null,0]
["2026-02-28",0,0,0,0,0,0,0,0,0,0,null,0]
["2026-03-31",0,0,0,0,0,0,0,0,0,0,null,0]
["2026-04-30",0,0,0,0,0,0,0,0,0,0,null,0]
["2026-05-31",0,0,0,0,0,0,0,0,0,0,null,0]
["2026-06-30",0,0,0,0,0,0,0,0,0,0,null,0]
["2026-07-31",0,0,0,0,0,0,0,0,0,0,null,0]
["2026-08-31",0,0,0,0,0,0,0,0,0,0,null,0]
["2026-09-30",0,0,0,0,0,0,0,0,0,0,null,0]
["2026-10-31",0,0,0,0,0,0,0,0,0,0,null,0]
["2026-11-30",0,0,0,0,0,0,0,0,0,0,null,0]
["2026-12-31",0,0,0,0,0,0,0,0,0,0,null,0]
["2027-01-31",0,0,0,0,0,{"$f":"+IF(B156=\"ESTINZIONE\",IF($C$23=\"sul cap.residuo\",I156*$B$23,J156*$B$23),0)","v":0},{"$f":"IF(B156=0,0,IF(B156=\"ESTINZIONE\",I156,0))","v":0},0,{"$f":"+SUM(M157:M516)","v":0},{"$f":"-E156-F156-G156-H156","v":0},null,0]
["2027-02-28",0,{"$f":"IF(B157=0,0,E157-D157)","v":0},{"$f":"IF(B157=0,0,I156*$B$19)","v":0},{"$f":"+IF(B157=0,0,E156)","v":0},{"$f":"+IF(B157=0,0,F156)","v":0},0,0,{"$f":"IF(B159=0,0,I156-C157)","v":0},0,0,null,{"$f":"IF(B157=0,0,$E$28)","v":0}]
[{"$f":"+EOMONTH(A157,$M$16)","v":"2027-03-31"},{"$f":"IF(B157=0,0,IF(B157>$B$20,0,IF(B157=\"ESTINZIONE\",0,IF(A158=$B$24,\"ESTINZIONE\",B157+1))))","v":0},0,0,0,0,0,0,0,0,0,null,0]
["2027-04-30",0,0,0,0,0,0,0,0,0,0,null,0]
["2027-05-31",0,0,0,0,0,0,0,0,0,0,null,0]
["2027-06-30",0,0,0,0,0,0,0,0,0,0,null,0]
["2027-07-31",0,0,0,0,0,0,0,0,0,0,null,0]
["2027-08-31",0,0,0,0,0,0,0,0,0,0,null,0]
["2027-09-30",0,0,0,0,0,0,0,0,0,0,null,0]
["2027-10-31",0,0,0,0,0,0,0,0,0,0,null,0]
["2027-11-30",0,0,0,0,0,0,0,0,0,0,null,0]
["2027-12-31",0,0,0,0,0,0,0,0,0,0,null,0]
["2028-01-31",0,0,0,0,0,0,0,0,0,0,null,0]
["2028-02-29",0,0,0,0,0,0,0,0,0,0,null,0]
["2028-03-31",0,0,0,0,0,0,0,0,0,0,null,0]
["2028-04-30",0,0,0,0,0,0,0,0,0,0,null,0]
["2028-05-31",0,0,0,0,0,0,0,0,0,0,null,0]
["2028-06-30",0,0,0,0,0,0,0,0,0,0,null,0]
["2028-07-31",0,0,0,0,0,0,0,0,0,0,null,0]
["2028-08-31",0,0,0,0,0,0,0,0,0,0,null,0]
["2028-09-30",0,0,0,0,0,0,0,0,0,0,null,0]
["2028-10-31",0,0,0,0,0,0,0,0,0,0,null,0]
["2028-11-30",0,0,0,0,0,0,0,0,0,0,null,0]
["2028-12-31",0,0,0,0,0,0,0,0,0,0,null,0]
["2029-01-31",0,0,0,0,0,0,0,0,0,0,null,0]
["2029-02-28",0,0,0,0,0,0,0,0,0,0,null,0]
["2029-03-31",0,0,0,0,0,0,0,0,0,0,null,0]
["2029-04-30",0,0,0,0,0,0,0,0,0,0,null,0]
["2029-05-31",0,0,0,0,0,0,0,0,0,0,null,0]
["2029-06-30",0,0,0,0,0,0,0,0,0,0,null,0]
["2029-07-31",0,0,0,0,0,0,0,0,0,0,null,0]
["2029-08-31",0,0,0,0,0,0,0,0,0,0,null,0]
["2029-09-30",0,0,0,0,0,0,{"$f":"IF(B188=0,0,IF(B188=\"ESTINZIONE\",I188,0))","v":0},0,0,{"$f":"-E188-F188-G188-H188","v":0},null,0]
["2029-10-31",0,{"$f":"IF(B189=0,0,E189-D189)","v":0},0,{"$f":"+IF(B189=0,0,E188)","v":0},{"$f":"+IF(B189=0,0,F188)","v":0},0,0,0,0,0,null,0]
["2029-11-30",0,0,0,0,0,0,0,0,0,0,null,0]
["2029-12-31",0,0,0,0,0,0,0,0,0,0,null,0]
["2030-01-31",0,0,0,0,0,0,0,0,0,0,null,0]
["2030-02-28",0,0,0,0,0,0,0,0,0,0,null,0]
["2030-03-31",0,0,0,0,0,0,0,0,0,0,null,0]
["2030-04-30",0,0,0,0,0,0,0,0,0,0,null,0]
["2030-05-31",0,0,0,0,0,0,0,0,0,0,null,0]
["2030-06-30",0,0,0,0,0,0,0,0,0,0,null,0]
["2030-07-31",0,0,0,0,0,0,0,0,0,0,null,0]
["2030-08-31",0,0,0,0,0,0,0,0,0,0,null,0]
["2030-09-30",0,0,0,0,0,0,0,0,0,0,null,0]
["2030-10-31",0,0,0,0,0,0,0,0,0,0,null,0]
["2030-11-30",0,0,0,0,0,0,0,0,0,0,null,0]
["2030-12-31",0,0,0,0,0,0,0,0,0,0,null,0]
["2031-01-31",0,0,0,0,0,0,0,0,0,0,null,0]
["2031-02-28",0,0,0,0,0,0,0,0,0,0,null,0]
["2031-03-31",0,0,0,0,0,0,0,0,0,0,null,0]
["2031-04-30",0,0,0,0,0,0,0,0,0,0,null,0]
["2031-05-31",0,{"$f":"IF(B208=0,0,E208-D208)","v":0},0,{"$f":"+IF(B208=0,0,E207)","v":0},{"$f":"+IF(B208=0,0,F207)","v":0},0,{"$f":"IF(B208=0,0,IF(B208=\"ESTINZIONE\",I208,0))","v":0},0,0,{"$f":"-E208-F208-G208-H208","v":0},null,0]
["2031-06-30",0,0,0,0,0,0,0,0,0,0,null,0]
["2031-07-31",0,0,0,0,0,0,0,0,0,0,null,0]
["2031-08-31",0,0,0,0,0,0,0,0,0,0,null,0]
["2031-09-30",0,0,0,0,0,0,0,0,0,0,null,0]
["2031-10-31",0,0,0,0,0,0,0,0,0,0,null,0]
["2031-11-30",0,0,0,0,0,0,0,0,0,0,null,0]
["2031-12-31",0,0,0,0,0,0,0,0,0,0,null,0]
["2032-01-31",0,0,0,0,0,0,0,0,0,0,null,0]
["2032-02-29",0,0,0,0,0,0,0,0,0,0,null,0]
["2032-03-31",0,0,0,0,0,0,0,0,0,0,null,0]
["2032-04-30",0,0,0,0,0,0,0,0,0,0,null,0]
["2032-05-31",0,0,0,0,0,{"$f":"+IF(B220=\"ESTINZIONE\",IF($C$23=\"sul cap.residuo\",I220*$B$23,J220*$B$23),0)","v":0},0,0,{"$f":"+SUM(M221:M580)","v":0},0,null,0]
["2032-06-30",0,0,{"$f":"IF(B221=0,0,I220*$B$19)","v":0},0,0,0,0,{"$f":"IF(B223=0,0,I220-C221)","v":0},0,0,null,{"$f":"IF(B221=0,0,$E$28)","v":0}]
[{"$f":"+EOMONTH(A221,$M$16)","v":"2032-07-31"},{"$f":"IF(B221=0,0,IF(B221>$B$20,0,IF(B221=\"ESTINZIONE\",0,IF(A222=$B$24,\"ESTINZIONE\",B221+1))))","v":0},0,0,0,0,0,0,0,0,0,null,0]
["2032-08-31",0,0,0,0,0,0,0,0,0,0,null,0]
["2032-09-30",0,0,0,0,0,0,0,0,0,0,null,0]
["2032-10-31",0,0,0,0,0,0,0,0,0,0,null,0]
["2032-11-30",0,0,0,0,0,0,0,0,0,0,null,0]
["2032-12-31",0,0,0,0,0,0,0,0,0,0,null,0]
["2033-01-31",0,0,0,0,0,0,0,0,0,0,null,0]
["2033-02-28",0,0,0,0,0,0,0,0,0,0,null,0]
["2033-03-31",0,0,0,0,0,0,0,0,0,0,null,0]
["2033-04-30",0,0,0,0,0,0,0,0,0,0,null,0]
["2033-05-31",0,0,0,0,0,0,0,0,0,0,null,0]
["2033-06-30",0,0,0,0,0,0,0,0,0,0,null,0]
["2033-07-31",0,0,0,0,0,0,0,0,0,0,null,0]
["2033-08-31",0,0,0,0,0,0,0,0,0,0,null,0]
["2033-09-30",0,0,0,0,0,0,0,0,0,0,null,0]
["2033-10-31",0,0,0,0,0,0,0,0,0,0,null,0]
["2033-11-30",0,0,0,0,0,0,0,0,0,0,null,0]
["2033-12-31",0,0,0,0,0,0,0,0,0,0,null,0]
["2034-01-31",0,0,0,0,0,0,0,0,0,0,null,0]
["2034-02-28",0,0,0,0,0,0,0,0,0,0,null,0]
["2034-03-31",0,0,0,0,0,0,0,0,0,0,null,0]
["2034-04-30",0,0,0,0,0,0,0,0,0,0,null,0]
["2034-05-31",0,0,0,0,0,0,0,0,0,0,null,0]
["2034-06-30",0,0,0,0,0,0,0,0,0,0,null,0]
["2034-07-31",0,0,0,0,0,0,0,0,0,0,null,0]
["2034-08-31",0,0,0,0,0,0,0,0,0,0,null,0]
["2034-09-30",0,0,0,0,0,0,0,0,0,0,null,0]
["2034-10-31",0,0,0,0,0,0,0,0,0,0,null,0]
["2034-11-30",0,0,0,0,0,0,0,0,0,0,null,0]
["2034-12-31",0,0,0,0,0,0,0,0,0,0,null,0]
["2035-01-31",0,0,0,0,0,0,0,0,0,0,null,0]
["2035-02-28",0,0,0,0,0,0,0,0,0,0,null,0]
["2035-03-31",0,0,0,0,0,0,0,0,0,0,null,0]
["2035-04-30",0,0,0,0,0,0,0,0,0,0,null,0]
["2035-05-31",0,0,0,0,0,0,0,0,0,0,null,0]
["2035-06-30",0,0,0,0,0,0,0,0,0,0,null,0]
["2035-07-31",0,0,0,0,0,0,0,0,0,0,null,0]
["2035-08-31",0,0,0,0,0,0,0,0,0,0,null,0]
["2035-09-30",0,0,0,0,0,0,0,0,0,0,null,0]
["2035-10-31",0,0,0,0,0,0,0,0,0,0,null,0]
["2035-11-30",0,0,0,0,0,0,0,0,0,0,null,0]
["2035-12-31",0,0,0,0,0,0,0,0,0,0,null,0]
["2036-01-31",0,0,0,0,0,0,0,0,0,0,null,0]
["2036-02-29",0,0,0,0,0,0,0,0,0,0,null,0]
["2036-03-31",0,0,0,0,0,0,0,0,0,0,null,0]
["2036-04-30",0,0,0,0,0,0,0,0,0,0,null,0]
["2036-05-31",0,0,0,0,0,0,0,0,0,0,null,0]
["2036-06-30",0,0,0,0,0,0,0,0,0,0,null,0]
["2036-07-31",0,0,0,0,0,0,0,0,0,0,null,0]
["2036-08-31",0,0,0,0,0,0,0,0,0,0,null,0]
["2036-09-30",0,{"$f":"IF(B272=0,0,E272-D272)","v":0},0,{"$f":"+IF(B272=0,0,E271)","v":0},{"$f":"+IF(B272=0,0,F271)","v":0},0,{"$f":"IF(B272=0,0,IF(B272=\"ESTINZIONE\",I272,0))","v":0},0,0,{"$f":"-E272-F272-G272-H272","v":0},null,0]
["2036-10-31",0,0,0,0,0,0,0,0,0,0,null,0]
["2036-11-30",0,0,0,0,0,0,0,0,0,0,null,0]
["2036-12-31",0,0,0,0,0,0,0,0,0,0,null,0]
["2037-01-31",0,0,0,0,0,0,0,0,0,0,null,0]
["2037-02-28",0,0,0,0,0,0,0,0,0,0,null,0]
["2037-03-31",0,0,0,0,0,0,0,0,0,0,null,0]
["2037-04-30",0,0,0,0,0,0,0,0,0,0,null,0]
["2037-05-31",0,0,0,0,0,0,0,0,0,0,null,0]
["2037-06-30",0,0,0,0,0,0,0,0,0,0,null,0]
["2037-07-31",0,0,0,0,0,0,0,0,0,0,null,0]
["2037-08-31",0,0,0,0,0,0,0,0,0,0,null,0]
["2037-09-30",0,0,0,0,0,{"$f":"+IF(B284=\"ESTINZIONE\",IF($C$23=\"sul cap.residuo\",I284*$B$23,J284*$B$23),0)","v":0},0,0,{"$f":"+SUM(M285:M644)","v":0},0,null,0]
["2037-10-31",0,0,{"$f":"IF(B285=0,0,I284*$B$19)","v":0},0,0,0,0,{"$f":"IF(B287=0,0,I284-C285)","v":0},0,0,null,{"$f":"IF(B285=0,0,$E$28)","v":0}]
[{"$f":"+EOMONTH(A285,$M$16)","v":"2037-11-30"},{"$f":"IF(B285=0,0,IF(B285>$B$20,0,IF(B285=\"ESTINZIONE\",0,IF(A286=$B$24,\"ESTINZIONE\",B285+1))))","v":0},0,0,0,0,0,0,0,0,0,null,0]
["2037-12-31",0,0,0,0,0,0,0,0,0,0,null,0]
["2038-01-31",0,0,0,0,0,0,0,0,0,0,null,0]
["2038-02-28",0,0,0,0,0,0,0,0,0,0,null,0]
["2038-03-31",0,0,0,0,0,0,0,0,0,0,null,0]
["2038-04-30",0,0,0,0,0,0,0,0,0,0,null,0]
["2038-05-31",0,0,0,0,0,0,0,0,0,0,null,0]
["2038-06-30",0,0,0,0,0,0,0,0,0,0,null,0]
["2038-07-31",0,0,0,0,0,0,0,0,0,0,null,0]
["2038-08-31",0,0,0,0,0,0,0,0,0,0,null,0]
["2038-09-30",0,0,0,0,0,0,0,0,0,0,null,0]
["2038-10-31",0,0,0,0,0,0,0,0,0,0,null,0]
["2038-11-30",0,0,0,0,0,0,0,0,0,0,null,0]
["2038-12-31",0,0,0,0,0,0,0,0,0,0,null,0]
["2039-01-31",0,0,0,0,0,0,0,0,0,0,null,0]
["2039-02-28",0,0,0,0,0,0,0,0,0,0,null,0]
["2039-03-31",0,0,0,0,0,0,0,0,0,0,null,0]
["2039-04-30",0,0,0,0,0,0,0,0,0,0,null,0]
["2039-05-31",0,0,0,0,0,0,0,0,0,0,null,0]
["2039-06-30",0,0,0,0,0,0,0,0,0,0,null,0]
["2039-07-31",0,0,0,0,0,0,0,0,0,0,null,0]
["2039-08-31",0,0,0,0,0,0,0,0,0,0,null,0]
["2039-09-30",0,0,0,0,0,0,0,0,0,0,null,0]
["2039-10-31",0,0,0,0,0,0,0,0,0,0,null,0]
["2039-11-30",0,0,0,0,0,0,0,0,0,0,null,0]
["2039-12-31",0,0,0,0,0,0,0,0,0,0,null,0]
["2040-01-31",0,0,0,0,0,0,0,0,0,0,null,0]
["2040-02-29",0,0,0,0,0,0,0,0,0,0,null,0]
["2040-03-31",0,0,0,0,0,0,0,0,0,0,null,0]
["2040-04-30",0,0,0,0,0,0,0,0,0,0,null,0]
["2040-05-31",0,0,0,0,0,0,0,0,0,0,null,0]
["2040-06-30",0,0,0,0,0,0,0,0,0,0,null,0]
["2040-07-31",0,0,0,0,0,0,0,0,0,0,null,0]
["2040-08-31",0,0,0,0,0,0,0,0,0,0,null,0]
["2040-09-30",0,0,0,0,0,0,0,0,0,0,null,0]
["2040-10-31",0,0,0,0,0,0,0,0,0,0,null,0]
["2040-11-30",0,0,0,0,0,0,0,0,0,0,null,0]
["2040-12-31",0,0,0,0,0,0,0,0,0,0,null,0]
["2041-01-31",0,0,0,0,0,0,0,0,0,0,null,0]
["2041-02-28",0,0,0,0,0,0,0,0,0,0,null,0]
["2041-03-31",0,0,0,0,0,0,0,0,0,0,null,0]
["2041-04-30",0,0,0,0,0,0,0,0,0,0,null,0]
["2041-05-31",0,0,0,0,0,0,0,0,0,0,null,0]
["2041-06-30",0,0,0,0,0,0,0,0,0,0,null,0]
["2041-07-31",0,0,0,0,0,0,0,0,0,0,null,0]
["2041-08-31",0,0,0,0,0,0,0,0,0,0,null,0]
["2041-09-30",0,0,0,0,0,0,0,0,0,0,null,0]
["2041-10-31",0,0,0,0,0,0,0,0,0,0,null,0]
["2041-11-30",0,0,0,0,0,0,0,0,0,0,null,0]
["2041-12-31",0,0,0,0,0,0,0,0,0,0,null,0]
["2042-01-31",0,{"$f":"IF(B336=0,0,E336-D336)","v":0},0,{"$f":"+IF(B336=0,0,E335)","v":0},{"$f":"+IF(B336=0,0,F335)","v":0},0,{"$f":"IF(B336=0,0,IF(B336=\"ESTINZIONE\",I336,0))","v":0},0,0,{"$f":"-E336-F336-G336-H336","v":0},null,0]
["2042-02-28",0,0,0,0,0,0,0,0,0,0,null,0]
["2042-03-31",0,0,0,0,0,0,0,0,0,0,null,0]
["2042-04-30",0,0,0,0,0,0,0,0,0,0,null,0]
["2042-05-31",0,0,0,0,0,0,0,0,0,0,null,0]
["2042-06-30",0,0,0,0,0,0,0,0,0,0,null,0]
["2042-07-31",0,0,0,0,0,0,0,0,0,0,null,0]
["2042-08-31",0,0,0,0,0,0,0,0,0,0,null,0]
["2042-09-30",0,0,0,0,0,0,0,0,0,0,null,0]
["2042-10-31",0,0,0,0,0,0,0,0,0,0,null,0]
["2042-11-30",0,0,0,0,0,0,0,0,0,0,null,0]
["2042-12-31",0,0,0,0,0,0,0,0,0,0,null,0]
["2043-01-31",0,0,0,0,0,{"$f":"+IF(B348=\"ESTINZIONE\",IF($C$23=\"sul cap.residuo\",I348*$B$23,J348*$B$23),0)","v":0},0,0,{"$f":"+SUM(M349:M708)","v":0},0,null,0]
["2043-02-28",0,0,{"$f":"IF(B349=0,0,I348*$B$19)","v":0},0,0,0,0,{"$f":"IF(B351=0,0,I348-C349)","v":0},0,0,null,{"$f":"IF(B349=0,0,$E$28)","v":0}]
[{"$f":"+EOMONTH(A349,$M$16)","v":"2043-03-31"},{"$f":"IF(B349=0,0,IF(B349>$B$20,0,IF(B349=\"ESTINZIONE\",0,IF(A350=$B$24,\"ESTINZIONE\",B349+1))))","v":0},0,0,0,0,0,0,0,0,0,null,0]
["2043-04-30",0,0,0,0,0,0,0,0,0,0,null,0]
["2043-05-31",0,0,0,0,0,0,0,0,0,0,null,0]
["2043-06-30",0,0,0,0,0,0,0,0,0,0,null,0]
["2043-07-31",0,0,0,0,0,0,0,0,0,0,null,0]
["2043-08-31",0,0,0,0,0,0,0,0,0,0,null,0]
["2043-09-30",0,0,0,0,0,0,0,0,0,0,null,0]
["2043-10-31",0,0,0,0,0,0,0,0,0,0,null,0]
["2043-11-30",0,0,0,0,0,0,0,0,0,0,null,0]
["2043-12-31",0,0,0,0,0,0,0,0,0,0,null,0]
["2044-01-31",0,0,0,0,0,0,0,0,0,0,null,0]
["2044-02-29",0,0,0,0,0,0,0,0,0,0,null,0]
["2044-03-31",0,0,0,0,0,0,0,0,0,0,null,0]
["2044-04-30",0,0,0,0,0,0,0,0,0,0,null,0]
["2044-05-31",0,0,0,0,0,0,0,0,0,0,null,0]
["2044-06-30",0,0,0,0,0,0,0,0,0,0,null,0]
["2044-07-31",0,0,0,0,0,0,0,0,0,0,null,0]
["2044-08-31",0,0,0,0,0,0,0,0,0,0,null,0]
["2044-09-30",0,0,0,0,0,0,0,0,0,{"$f":"-E368-F368-G368-H368","v":0},null,0]
["2044-10-31",0,0,0,0,0,0,0,0,0,0,null,0]
["2044-11-30",0,0,0,0,0,0,0,0,0,0,null,0]
["2044-12-31",0,0,0,0,0,0,0,0,0,0,null,0]
["2045-01-31",0,0,0,0,0,0,0,0,0,0,null,0]
["2045-02-28",0,0,0,0,0,0,0,0,0,0,null,0]
["2045-03-31",0,0,0,0,0,0,0,0,0,0,null,0]
["2045-04-30",0,0,0,0,0,0,0,0,0,0,null,0]
["2045-05-31",0,0,0,0,0,0,0,0,0,0,null,0]
["2045-06-30",0,0,0,0,0,0,0,0,0,0,null,0]
["2045-07-31",0,0,0,0,0,0,0,0,0,0,null,0]
["2045-08-31",0,0,0,0,0,0,0,0,0,0,null,0]
["2045-09-30",0,0,0,0,0,0,0,0,0,0,null,0]
["2045-10-31",0,0,0,0,0,0,0,0,0,0,null,0]
["2045-11-30",0,0,0,0,0,0,0,0,0,0,null,0]
["2045-12-31",0,0,0,0,0,0,0,0,0,0,null,0]
["2046-01-31",0,0,0,0,0,0,0,0,0,0,null,0]
["2046-02-28",0,0,0,0,0,0,0,0,0,0,null,0]
["2046-03-31",0,0,0,0,0,0,0,0,0,0,null,0]
["2046-04-30",0,0,0,0,0,0,0,0,0,0,null,0]

{"sheet":"8) OUTPUT TASSAZIONE","index":7,"n_rows":27,"n_cols":10,"rows_kept":27,"cut":false,"hidden":false,"merged":[[0,1,0,9],[1,1,1,9],[18,1,18,2]]}
[null,"BUSINESS PLAN"]
[null,"CALCOLO IMPOSTE SUI REDDITI REGIME FORFETTARIO"]
[null,null,{"$f":"+'4) INPUT INPS'!L3","v":2016},"CHECK",{"$f":"+C3+1","v":2017},"CHECK",{"$f":"+E3+1","v":2018},"CHECK",2019,"CHECK"]
[null,"RICAVI",{"$f":"+'3) INPUT VENDITE'!CD4","v":26016},{"$f":"+IF(C4>'1) INPUT BASE'!$G$5,\"USCITA REGIME\",\"OK\")","v":"OK"},{"$f":"+'3) INPUT VENDITE'!CD5","v":27816},{"$f":"+IF(E4>'1) INPUT BASE'!$G$5,\"USCITA REGIME\",\"OK\")","v":"OK"},{"$f":"+'3) INPUT VENDITE'!CD6","v":27816},{"$f":"+IF(G4>'1) INPUT BASE'!$G$5,\"USCITA REGIME\",\"OK\")","v":"OK"},{"$f":"+'3) INPUT VENDITE'!CD7","v":1800},{"$f":"+IF(I4>'1) INPUT BASE'!$G$5,\"USCITA REGIME\",\"OK\")","v":"OK"}]
[null,"ALIQUOTA REDDITIVITA' FORFETTARIA",{"$f":"+'1) INPUT BASE'!$G$6","v":0.4},null,{"$f":"+'1) INPUT BASE'!$G$6","v":0.4},null,{"$f":"+'1) INPUT BASE'!$G$6","v":0.4},null,{"$f":"+'1) INPUT BASE'!$G$6","v":0.4}]
[null,"TOTALE",{"$f":"+C4*C5","v":10406.400000000001},null,{"$f":"+E4*E5","v":11126.400000000001},null,{"$f":"+G4*G5","v":11126.400000000001},null,{"$f":"+I4*I5","v":720}]
[null,"CONTRIBUTI VERSATI",{"$f":"+'4) INPUT INPS'!S19","v":0},null,{"$f":"+'4) INPUT INPS'!S20","v":0},null,{"$f":"+'4) INPUT INPS'!S21","v":0},null,{"$f":"+'4) INPUT INPS'!S22","v":0}]
[null,"BASE IMPONIBILE",{"$f":"+C6-C7","v":10406.400000000001},null,{"$f":"+E6-E7","v":11126.400000000001},null,11126.400000000001,null,{"$f":"+I6-I7","v":720}]
[null,"ALIQUOTA IMPOSTA FORFETTARIA",{"$f":"+'1) INPUT BASE'!$G$7","v":0.05},null,{"$f":"+'1) INPUT BASE'!$G$7","v":0.05},null,{"$f":"+'1) INPUT BASE'!$G$7","v":0.05},null,{"$f":"+'1) INPUT BASE'!$G$7","v":0.05}]
[null,"IMPOSTA DOVUTA",{"$f":"+C8*C9","v":520.32000000000005},null,{"$f":"+E8*E9","v":556.32000000000005},null,{"$f":"+G8*G9","v":556.32000000000005},null,{"$f":"+I8*I9","v":36}]
[null,"ACCONTI VERSATI",0,null,{"$f":"+C15+C16","v":520.32000000000005},null,{"$f":"+E15+E16","v":36},null,{"$f":"+G15+G16","v":520.32000000000005}]
[null,"CREDITO DICHIARAZIONE PRECEDENTE",null,null,{"$f":"+C14","v":0},null,{"$f":"+E14","v":0},null,{"$f":"+G14","v":0}]
[null,"SALDO",{"$f":"IF(C10-C11<0,0,C10-C11)","v":520.32000000000005},null,{"$f":"IF(E10-E11-C14<0,0,E10-E11-C14)","v":36},null,{"$f":"IF(G10-G11-E14-G12<0,0,G10-G11-E14-G12)","v":520.32000000000005},null,{"$f":"IF(I10-I11-G14<0,0,I10-I11-G14)","v":0}]
[null,"CREDITO",{"$f":"+IF(C13=0,-(C10-C11),0)","v":0},null,{"$f":"+IF(E13=0,-(E10-E11),0)","v":0},null,{"$f":"+IF(G13=0,-(G10-G11-G12),0)","v":0},null,{"$f":"+IF(I13=0,-(I10-I11),0)","v":484.32000000000005}]
[null,"I ACCONTO",{"$f":"+C13*0.4","v":208.12800000000004},null,{"$f":"+E13*0.4","v":14.4},null,{"$f":"+G13*0.4","v":208.12800000000004},null,{"$f":"+I13*0.4","v":0}]
[null,"II ACCONTO",{"$f":"+C13*0.6","v":312.19200000000001},null,{"$f":"+E13*0.6","v":21.599999999999998},null,{"$f":"+G13*0.6","v":312.19200000000001},null,{"$f":"+I13*0.6","v":0}]
[]
[]
[null,"FLUSSI"]
[null,{"$f":"+DATE(E3,6,30)","v":"2017-06-30"},{"$f":"+C13+C15","v":728.44800000000009}]
[null,{"$f":"+DATE(E3,11,30)","v":"2017-11-30"},{"$f":"+C16","v":312.19200000000001}]
[null,{"$f":"+EOMONTH(B20,12)","v":"2018-06-30"},{"$f":"+E13+E15","v":50.4}]
[null,{"$f":"+EOMONTH(B21,12)","v":"2018-11-30"},{"$f":"+E16","v":21.599999999999998}]
[null,"2019-06-30",{"$f":"+G13+G15","v":728.44800000000009}]
[null,"2019-11-30",{"$f":"+G16","v":312.19200000000001}]
[null,{"$f":"+EOMONTH(B24,12)","v":"2020-06-30"},{"$f":"+I13+I15","v":0}]
[null,"2020-11-30",{"$f":"+I16","v":0}]

{"sheet":"9) OUTPUT FLUSSI DI CASSA","index":8,"n_rows":129,"n_cols":42,"rows_kept":129,"cut":false,"hidden":false,"merged":[[125,1,125,6],[128,0,131,13]]}
["BUSINESS PLAN PER L'EXTRALBERGHIERO"]
["DOTT. LEONE GABRIELE"]
["WWW.BNBMAKER.COM - WWW.LEONEADVISOR.IT"]
["ENTRATE",{"$f":"+'3) INPUT VENDITE'!B2","v":"2016-04-30"},{"$f":"+'3) INPUT VENDITE'!C2","v":"2016-05-31"},{"$f":"+'3) INPUT VENDITE'!D2","v":"2016-06-30"},{"$f":"+'3) INPUT VENDITE'!E2","v":"2016-07-31"},{"$f":"+'3) INPUT VENDITE'!F2","v":"2016-08-31"},{"$f":"+'3) INPUT VENDITE'!G2","v":"2016-09-30"},{"$f":"+'3) INPUT VENDITE'!H2","v":"2016-10-31"},{"$f":"+'3) INPUT VENDITE'!I2","v":"2016-11-30"},{"$f":"+'3) INPUT VENDITE'!J2","v":"2016-12-31"},{"$f":"+'3) INPUT VENDITE'!K2","v":"2017-01-31"},{"$f":"+'3) INPUT VENDITE'!L2","v":"2017-02-28"},{"$f":"+'3) INPUT VENDITE'!M2","v":"2017-03-31"},{"$f":"+'3) INPUT VENDITE'!N2","v":"TOTALE"},null,{"$f":"+'3) INPUT VENDITE'!P2","v":"2017-04-30"},{"$f":"+'3) INPUT VENDITE'!Q2","v":"2017-05-31"},{"$f":"+'3) INPUT VENDITE'!R2","v":"2017-06-30"},{"$f":"+'3) INPUT VENDITE'!S2","v":"2017-07-31"},{"$f":"+'3) INPUT VENDITE'!T2","v":"2017-08-31"},{"$f":"+'3) INPUT VENDITE'!U2","v":"2017-09-30"},{"$f":"+'3) INPUT VENDITE'!V2","v":"2017-10-31"},{"$f":"+'3) INPUT VENDITE'!W2","v":"2017-11-30"},{"$f":"+'3) INPUT VENDITE'!X2","v":"2017-12-31"},{"$f":"+'3) INPUT VENDITE'!Y2","v":"2018-01-31"},{"$f":"+'3) INPUT VENDITE'!Z2","v":"2018-02-28"},{"$f":"+'3) INPUT VENDITE'!AA2","v":"2018-03-31"},{"$f":"+'3) INPUT VENDITE'!AB2","v":"TOTALE"},null,{"$f":"+'3) INPUT VENDITE'!AD2","v":"2018-04-30"},{"$f":"+'3) INPUT VENDITE'!AE2","v":"2018-05-31"},{"$f":"+'3) INPUT VENDITE'!AF2","v":"2018-06-30"},{"$f":"+'3) INPUT VENDITE'!AG2","v":"2018-07-31"},{"$f":"+'3) INPUT VENDITE'!AH2","v":"2018-08-31"},{"$f":"+'3) INPUT VENDITE'!AI2","v":"2018-09-30"},{"$f":"+'3) INPUT VENDITE'!AJ2","v":"2018-10-31"},{"$f":"+'3) INPUT VENDITE'!AK2","v":"2018-11-30"},{"$f":"+'3) INPUT VENDITE'!AL2","v":"2018-12-31"},{"$f":"+'3) INPUT VENDITE'!AM2","v":"2019-01-31"},{"$f":"+'3) INPUT VENDITE'!AN2","v":"2019-02-28"},{"$f":"+'3) INPUT VENDITE'!AO2","v":"2019-03-31"},{"$f":"+'3) INPUT VENDITE'!AP2","v":"TOTALE"}]
[{"$f":"+'3) INPUT VENDITE'!A4","v":"CAMERE QUADRUPLE"},{"$f":"+'3) INPUT VENDITE'!B4","v":0},{"$f":"+'3) INPUT VENDITE'!C4","v":0},{"$f":"+'3) INPUT VENDITE'!D4","v":0},{"$f":"+'3) INPUT VENDITE'!E4","v":0},{"$f":"+'3) INPUT VENDITE'!F4","v":0},{"$f":"+'3) INPUT VENDITE'!G4","v":0},{"$f":"+'3) INPUT VENDITE'!H4","v":0},{"$f":"+'3) INPUT VENDITE'!I4","v":0},{"$f":"+'3) INPUT VENDITE'!J4","v":0},{"$f":"+'3) INPUT VENDITE'!K4","v":0},{"$f":"+'3) INPUT VENDITE'!L4","v":0},{"$f":"+'3) INPUT VENDITE'!M4","v":0},{"$f":"SUM(B5:M5)","v":0},null,{"$f":"+'3) INPUT VENDITE'!P4","v":0},{"$f":"+'3) INPUT VENDITE'!Q4","v":0},{"$f":"+'3) INPUT VENDITE'!R4","v":0},{"$f":"+'3) INPUT VENDITE'!S4","v":0},{"$f":"+'3) INPUT VENDITE'!T4","v":0},{"$f":"+'3) INPUT VENDITE'!U4","v":0},{"$f":"+'3) INPUT VENDITE'!V4","v":0},{"$f":"+'3) INPUT VENDITE'!W4","v":0},{"$f":"+'3) INPUT VENDITE'!X4","v":0},{"$f":"+'3) INPUT VENDITE'!Y4","v":0},{"$f":"+'3) INPUT VENDITE'!Z4","v":0},{"$f":"+'3) INPUT VENDITE'!AA4","v":0},{"$f":"SUM(P5:AA5)","v":0},null,{"$f":"+'3) INPUT VENDITE'!AD4","v":0},{"$f":"+'3) INPUT VENDITE'!AE4","v":0},{"$f":"+'3) INPUT VENDITE'!AF4","v":0},{"$f":"+'3) INPUT VENDITE'!AG4","v":0},{"$f":"+'3) INPUT VENDITE'!AH4","v":0},{"$f":"+'3) INPUT VENDITE'!AI4","v":0},{"$f":"+'3) INPUT VENDITE'!AJ4","v":0},{"$f":"+'3) INPUT VENDITE'!AK4","v":0},{"$f":"+'3) INPUT VENDITE'!AL4","v":0},{"$f":"+'3) INPUT VENDITE'!AM4","v":0},{"$f":"+'3) INPUT VENDITE'!AN4","v":0},{"$f":"+'3) INPUT VENDITE'!AO4","v":0},{"$f":"SUM(AD5:AO5)","v":0}]
[{"$f":"+'3) INPUT VENDITE'!A5","v":"CAMERE TRIPLE"},{"$f":"+'3) INPUT VENDITE'!B5","v":0},{"$f":"+'3) INPUT VENDITE'!C5","v":0},{"$f":"+'3) INPUT VENDITE'!D5","v":0},{"$f":"+'3) INPUT VENDITE'!E5","v":0},{"$f":"+'3) INPUT VENDITE'!F5","v":0},{"$f":"+'3) INPUT VENDITE'!G5","v":0},{"$f":"+'3) INPUT VENDITE'!H5","v":0},{"$f":"+'3) INPUT VENDITE'!I5","v":0},{"$f":"+'3) INPUT VENDITE'!J5","v":0},{"$f":"+'3) INPUT VENDITE'!K5","v":0},{"$f":"+'3) INPUT VENDITE'!L5","v":0},{"$f":"+'3) INPUT VENDITE'!M5","v":0},0,null,{"$f":"+'3) INPUT VENDITE'!P5","v":0},{"$f":"+'3) INPUT VENDITE'!Q5","v":0},{"$f":"+'3) INPUT VENDITE'!R5","v":0},{"$f":"+'3) INPUT VENDITE'!S5","v":0},{"$f":"+'3) INPUT VENDITE'!T5","v":0},{"$f":"+'3) INPUT VENDITE'!U5","v":0},{"$f":"+'3) INPUT VENDITE'!V5","v":0},{"$f":"+'3) INPUT VENDITE'!W5","v":0},{"$f":"+'3) INPUT VENDITE'!X5","v":0},{"$f":"+'3) INPUT VENDITE'!Y5","v":0},{"$f":"+'3) INPUT VENDITE'!Z5","v":0},{"$f":"+'3) INPUT VENDITE'!AA5","v":0},{"$f":"SUM(P6:AA6)","v":0},null,{"$f":"+'3) INPUT VENDITE'!AD5","v":0},{"$f":"+'3) INPUT VENDITE'!AE5","v":0},{"$f":"+'3) INPUT VENDITE'!AF5","v":0},{"$f":"+'3) INPUT VENDITE'!AG5","v":0},{"$f":"+'3) INPUT VENDITE'!AH5","v":0},{"$f":"+'3) INPUT VENDITE'!AI5","v":0},{"$f":"+'3) INPUT VENDITE'!AJ5","v":0},{"$f":"+'3) INPUT VENDITE'!AK5","v":0},{"$f":"+'3) INPUT VENDITE'!AL5","v":0},{"$f":"+'3) INPUT VENDITE'!AM5","v":0},{"$f":"+'3) INPUT VENDITE'!AN5","v":0},{"$f":"+'3) INPUT VENDITE'!AO5","v":0},{"$f":"SUM(AD6:AO6)","v":0}]
[{"$f":"+'3) INPUT VENDITE'!A6","v":"CAMERE DOPPIE"},{"$f":"+'3) INPUT VENDITE'!B6","v":600},{"$f":"+'3) INPUT VENDITE'!C6","v":2170},{"$f":"+'3) INPUT VENDITE'!D6","v":4860},{"$f":"+'3) INPUT VENDITE'!E6","v":5022},{"$f":"+'3) INPUT VENDITE'!F6","v":5022},{"$f":"+'3) INPUT VENDITE'!G6","v":2100},{"$f":"+'3) INPUT VENDITE'!H6","v":620},{"$f":"+'3) INPUT VENDITE'!I6","v":600},{"$f":"+'3) INPUT VENDITE'!J6","v":5022},{"$f":"+'3) INPUT VENDITE'!K6","v":620},{"$f":"+'3) INPUT VENDITE'!L6","v":560},{"$f":"+'3) INPUT VENDITE'!M6","v":620},27816,null,{"$f":"+'3) INPUT VENDITE'!P6","v":600},{"$f":"+'3) INPUT VENDITE'!Q6","v":2170},{"$f":"+'3) INPUT VENDITE'!R6","v":4860},{"$f":"+'3) INPUT VENDITE'!S6","v":5022},{"$f":"+'3) INPUT VENDITE'!T6","v":5022},{"$f":"+'3) INPUT VENDITE'!U6","v":2100},{"$f":"+'3) INPUT VENDITE'!V6","v":620},{"$f":"+'3) INPUT VENDITE'!W6","v":600},{"$f":"+'3) INPUT VENDITE'!X6","v":5022},{"$f":"+'3) INPUT VENDITE'!Y6","v":620},{"$f":"+'3) INPUT VENDITE'!Z6","v":560},{"$f":"+'3) INPUT VENDITE'!AA6","v":620},27816,null,{"$f":"+'3) INPUT VENDITE'!AD6","v":600},{"$f":"+'3) INPUT VENDITE'!AE6","v":2170},{"$f":"+'3) INPUT VENDITE'!AF6","v":4860},{"$f":"+'3) INPUT VENDITE'!AG6","v":5022},{"$f":"+'3) INPUT VENDITE'!AH6","v":5022},{"$f":"+'3) INPUT VENDITE'!AI6","v":2100},{"$f":"+'3) INPUT VENDITE'!AJ6","v":620},{"$f":"+'3) INPUT VENDITE'!AK6","v":600},{"$f":"+'3) INPUT VENDITE'!AL6","v":5022},{"$f":"+'3) INPUT VENDITE'!AM6","v":620},{"$f":"+'3) INPUT VENDITE'!AN6","v":560},{"$f":"+'3) INPUT VENDITE'!AO6","v":620},27816]
[{"$f":"+'3) INPUT VENDITE'!A7","v":"CAMERE SINGOLE"},{"$f":"+'3) INPUT VENDITE'!B7","v":0},{"$f":"+'3) INPUT VENDITE'!C7","v":0},{"$f":"+'3) INPUT VENDITE'!D7","v":0},{"$f":"+'3) INPUT VENDITE'!E7","v":0},{"$f":"+'3) INPUT VENDITE'!F7","v":0},{"$f":"+'3) INPUT VENDITE'!G7","v":0},{"$f":"+'3) INPUT VENDITE'!H7","v":0},{"$f":"+'3) INPUT VENDITE'!I7","v":0},{"$f":"+'3) INPUT VENDITE'!J7","v":0},{"$f":"+'3) INPUT VENDITE'!K7","v":0},{"$f":"+'3) INPUT VENDITE'!L7","v":0},{"$f":"+'3) INPUT VENDITE'!M7","v":0},0,null,{"$f":"+'3) INPUT VENDITE'!P7","v":0},{"$f":"+'3) INPUT VENDITE'!Q7","v":0},{"$f":"+'3) INPUT VENDITE'!R7","v":0},{"$f":"+'3) INPUT VENDITE'!S7","v":0},{"$f":"+'3) INPUT VENDITE'!T7","v":0},{"$f":"+'3) INPUT VENDITE'!U7","v":0},{"$f":"+'3) INPUT VENDITE'!V7","v":0},{"$f":"+'3) INPUT VENDITE'!W7","v":0},{"$f":"+'3) INPUT VENDITE'!X7","v":0},{"$f":"+'3) INPUT VENDITE'!Y7","v":0},{"$f":"+'3) INPUT VENDITE'!Z7","v":0},{"$f":"+'3) INPUT VENDITE'!AA7","v":0},0,null,{"$f":"+'3) INPUT VENDITE'!AD7","v":0},{"$f":"+'3) INPUT VENDITE'!AE7","v":0},{"$f":"+'3) INPUT VENDITE'!AF7","v":0},{"$f":"+'3) INPUT VENDITE'!AG7","v":0},{"$f":"+'3) INPUT VENDITE'!AH7","v":0},{"$f":"+'3) INPUT VENDITE'!AI7","v":0},{"$f":"+'3) INPUT VENDITE'!AJ7","v":0},{"$f":"+'3) INPUT VENDITE'!AK7","v":0},{"$f":"+'3) INPUT VENDITE'!AL7","v":0},{"$f":"+'3) INPUT VENDITE'!AM7","v":0},{"$f":"+'3) INPUT VENDITE'!AN7","v":0},{"$f":"+'3) INPUT VENDITE'!AO7","v":0},0]
[{"$f":"+'3) INPUT VENDITE'!A8","v":"VISITE GUIDATE"},{"$f":"+'3) INPUT VENDITE'!B8","v":0},{"$f":"+'3) INPUT VENDITE'!C8","v":0},{"$f":"+'3) INPUT VENDITE'!D8","v":0},{"$f":"+'3) INPUT VENDITE'!E8","v":0},{"$f":"+'3) INPUT VENDITE'!F8","v":0},{"$f":"+'3) INPUT VENDITE'!G8","v":0},{"$f":"+'3) INPUT VENDITE'!H8","v":0},{"$f":"+'3) INPUT VENDITE'!I8","v":0},{"$f":"+'3) INPUT VENDITE'!J8","v":0},{"$f":"+'3) INPUT VENDITE'!K8","v":0},{"$f":"+'3) INPUT VENDITE'!L8","v":0},{"$f":"+'3) INPUT VENDITE'!M8","v":0},0,null,{"$f":"+'3) INPUT VENDITE'!P8","v":0},{"$f":"+'3) INPUT VENDITE'!Q8","v":0},{"$f":"+'3) INPUT VENDITE'!R8","v":0},{"$f":"+'3) INPUT VENDITE'!S8","v":0},{"$f":"+'3) INPUT VENDITE'!T8","v":0},{"$f":"+'3) INPUT VENDITE'!U8","v":0},{"$f":"+'3) INPUT VENDITE'!V8","v":0},{"$f":"+'3) INPUT VENDITE'!W8","v":0},{"$f":"+'3) INPUT VENDITE'!X8","v":0},{"$f":"+'3) INPUT VENDITE'!Y8","v":0},{"$f":"+'3) INPUT VENDITE'!Z8","v":0},{"$f":"+'3) INPUT VENDITE'!AA8","v":0},0,null,{"$f":"+'3) INPUT VENDITE'!AD8","v":0},{"$f":"+'3) INPUT VENDITE'!AE8","v":0},{"$f":"+'3) INPUT VENDITE'!AF8","v":0},{"$f":"+'3) INPUT VENDITE'!AG8","v":0},{"$f":"+'3) INPUT VENDITE'!AH8","v":0},{"$f":"+'3) INPUT VENDITE'!AI8","v":0},{"$f":"+'3) INPUT VENDITE'!AJ8","v":0},{"$f":"+'3) INPUT VENDITE'!AK8","v":0},{"$f":"+'3) INPUT VENDITE'!AL8","v":0},{"$f":"+'3) INPUT VENDITE'!AM8","v":0},{"$f":"+'3) INPUT VENDITE'!AN8","v":0},{"$f":"+'3) INPUT VENDITE'!AO8","v":0},0]
[{"$f":"+'3) INPUT VENDITE'!A9","v":"Altri ricavi"},{"$f":"+'3) INPUT VENDITE'!B9","v":0},{"$f":"+'3) INPUT VENDITE'!C9","v":0},{"$f":"+'3) INPUT VENDITE'!D9","v":0},{"$f":"+'3) INPUT VENDITE'!E9","v":0},{"$f":"+'3) INPUT VENDITE'!F9","v":0},{"$f":"+'3) INPUT VENDITE'!G9","v":0},{"$f":"+'3) INPUT VENDITE'!H9","v":0},{"$f":"+'3) INPUT VENDITE'!I9","v":0},{"$f":"+'3) INPUT VENDITE'!J9","v":0},{"$f":"+'3) INPUT VENDITE'!K9","v":0},{"$f":"+'3) INPUT VENDITE'!L9","v":0},{"$f":"+'3) INPUT VENDITE'!M9","v":0},0,null,{"$f":"+'3) INPUT VENDITE'!P9","v":0},{"$f":"+'3) INPUT VENDITE'!Q9","v":0},{"$f":"+'3) INPUT VENDITE'!R9","v":0},{"$f":"+'3) INPUT VENDITE'!S9","v":0},{"$f":"+'3) INPUT VENDITE'!T9","v":0},{"$f":"+'3) INPUT VENDITE'!U9","v":0},{"$f":"+'3) INPUT VENDITE'!V9","v":0},{"$f":"+'3) INPUT VENDITE'!W9","v":0},{"$f":"+'3) INPUT VENDITE'!X9","v":0},{"$f":"+'3) INPUT VENDITE'!Y9","v":0},{"$f":"+'3) INPUT VENDITE'!Z9","v":0},{"$f":"+'3) INPUT VENDITE'!AA9","v":0},0,null,{"$f":"+'3) INPUT VENDITE'!AD9","v":0},{"$f":"+'3) INPUT VENDITE'!AE9","v":0},{"$f":"+'3) INPUT VENDITE'!AF9","v":0},{"$f":"+'3) INPUT VENDITE'!AG9","v":0},{"$f":"+'3) INPUT VENDITE'!AH9","v":0},{"$f":"+'3) INPUT VENDITE'!AI9","v":0},{"$f":"+'3) INPUT VENDITE'!AJ9","v":0},{"$f":"+'3) INPUT VENDITE'!AK9","v":0},{"$f":"+'3) INPUT VENDITE'!AL9","v":0},{"$f":"+'3) INPUT VENDITE'!AM9","v":0},{"$f":"+'3) INPUT VENDITE'!AN9","v":0},{"$f":"+'3) INPUT VENDITE'!AO9","v":0},0]
[{"$f":"+'3) INPUT VENDITE'!A10","v":"Altri ricavi"},{"$f":"+'3) INPUT VENDITE'!B10","v":0},{"$f":"+'3) INPUT VENDITE'!C10","v":0},{"$f":"+'3) INPUT VENDITE'!D10","v":0},{"$f":"+'3) INPUT VENDITE'!E10","v":0},{"$f":"+'3) INPUT VENDITE'!F10","v":0},{"$f":"+'3) INPUT VENDITE'!G10","v":0},{"$f":"+'3) INPUT VENDITE'!H10","v":0},{"$f":"+'3) INPUT VENDITE'!I10","v":0},{"$f":"+'3) INPUT VENDITE'!J10","v":0},{"$f":"+'3) INPUT VENDITE'!K10","v":0},{"$f":"+'3) INPUT VENDITE'!L10","v":0},{"$f":"+'3) INPUT VENDITE'!M10","v":0},0,null,{"$f":"+'3) INPUT VENDITE'!P10","v":0},{"$f":"+'3) INPUT VENDITE'!Q10","v":0},{"$f":"+'3) INPUT VENDITE'!R10","v":0},{"$f":"+'3) INPUT VENDITE'!S10","v":0},{"$f":"+'3) INPUT VENDITE'!T10","v":0},{"$f":"+'3) INPUT VENDITE'!U10","v":0},{"$f":"+'3) INPUT VENDITE'!V10","v":0},{"$f":"+'3) INPUT VENDITE'!W10","v":0},{"$f":"+'3) INPUT VENDITE'!X10","v":0},{"$f":"+'3) INPUT VENDITE'!Y10","v":0},{"$f":"+'3) INPUT VENDITE'!Z10","v":0},{"$f":"+'3) INPUT VENDITE'!AA10","v":0},0,null,{"$f":"+'3) INPUT VENDITE'!AD10","v":0},{"$f":"+'3) INPUT VENDITE'!AE10","v":0},{"$f":"+'3) INPUT VENDITE'!AF10","v":0},{"$f":"+'3) INPUT VENDITE'!AG10","v":0},{"$f":"+'3) INPUT VENDITE'!AH10","v":0},{"$f":"+'3) INPUT VENDITE'!AI10","v":0},{"$f":"+'3) INPUT VENDITE'!AJ10","v":0},{"$f":"+'3) INPUT VENDITE'!AK10","v":0},{"$f":"+'3) INPUT VENDITE'!AL10","v":0},{"$f":"+'3) INPUT VENDITE'!AM10","v":0},{"$f":"+'3) INPUT VENDITE'!AN10","v":0},{"$f":"+'3) INPUT VENDITE'!AO10","v":0},0]
[{"$f":"+'3) INPUT VENDITE'!A11","v":"Altri ricavi"},{"$f":"+'3) INPUT VENDITE'!B11","v":0},{"$f":"+'3) INPUT VENDITE'!C11","v":0},{"$f":"+'3) INPUT VENDITE'!D11","v":0},{"$f":"+'3) INPUT VENDITE'!E11","v":0},{"$f":"+'3) INPUT VENDITE'!F11","v":0},{"$f":"+'3) INPUT VENDITE'!G11","v":0},{"$f":"+'3) INPUT VENDITE'!H11","v":0},{"$f":"+'3) INPUT VENDITE'!I11","v":0},{"$f":"+'3) INPUT VENDITE'!J11","v":0},{"$f":"+'3) INPUT VENDITE'!K11","v":0},{"$f":"+'3) INPUT VENDITE'!L11","v":0},{"$f":"+'3) INPUT VENDITE'!M11","v":0},0,null,{"$f":"+'3) INPUT VENDITE'!P11","v":0},{"$f":"+'3) INPUT VENDITE'!Q11","v":0},{"$f":"+'3) INPUT VENDITE'!R11","v":0},{"$f":"+'3) INPUT VENDITE'!S11","v":0},{"$f":"+'3) INPUT VENDITE'!T11","v":0},{"$f":"+'3) INPUT VENDITE'!U11","v":0},{"$f":"+'3) INPUT VENDITE'!V11","v":0},{"$f":"+'3) INPUT VENDITE'!W11","v":0},{"$f":"+'3) INPUT VENDITE'!X11","v":0},{"$f":"+'3) INPUT VENDITE'!Y11","v":0},{"$f":"+'3) INPUT VENDITE'!Z11","v":0},{"$f":"+'3) INPUT VENDITE'!AA11","v":0},0,null,{"$f":"+'3) INPUT VENDITE'!AD11","v":0},{"$f":"+'3) INPUT VENDITE'!AE11","v":0},{"$f":"+'3) INPUT VENDITE'!AF11","v":0},{"$f":"+'3) INPUT VENDITE'!AG11","v":0},{"$f":"+'3) INPUT VENDITE'!AH11","v":0},{"$f":"+'3) INPUT VENDITE'!AI11","v":0},{"$f":"+'3) INPUT VENDITE'!AJ11","v":0},{"$f":"+'3) INPUT VENDITE'!AK11","v":0},{"$f":"+'3) INPUT VENDITE'!AL11","v":0},{"$f":"+'3) INPUT VENDITE'!AM11","v":0},{"$f":"+'3) INPUT VENDITE'!AN11","v":0},{"$f":"+'3) INPUT VENDITE'!AO11","v":0},0]
[{"$f":"+'3) INPUT VENDITE'!A12","v":"Altri ricavi"},{"$f":"+'3) INPUT VENDITE'!B12","v":0},{"$f":"+'3) INPUT VENDITE'!C12","v":0},{"$f":"+'3) INPUT VENDITE'!D12","v":0},{"$f":"+'3) INPUT VENDITE'!E12","v":0},{"$f":"+'3) INPUT VENDITE'!F12","v":0},{"$f":"+'3) INPUT VENDITE'!G12","v":0},{"$f":"+'3) INPUT VENDITE'!H12","v":0},{"$f":"+'3) INPUT VENDITE'!I12","v":0},{"$f":"+'3) INPUT VENDITE'!J12","v":0},{"$f":"+'3) INPUT VENDITE'!K12","v":0},{"$f":"+'3) INPUT VENDITE'!L12","v":0},{"$f":"+'3) INPUT VENDITE'!M12","v":0},0,null,{"$f":"+'3) INPUT VENDITE'!P12","v":0},{"$f":"+'3) INPUT VENDITE'!Q12","v":0},{"$f":"+'3) INPUT VENDITE'!R12","v":0},{"$f":"+'3) INPUT VENDITE'!S12","v":0},{"$f":"+'3) INPUT VENDITE'!T12","v":0},{"$f":"+'3) INPUT VENDITE'!U12","v":0},{"$f":"+'3) INPUT VENDITE'!V12","v":0},{"$f":"+'3) INPUT VENDITE'!W12","v":0},{"$f":"+'3) INPUT VENDITE'!X12","v":0},{"$f":"+'3) INPUT VENDITE'!Y12","v":0},{"$f":"+'3) INPUT VENDITE'!Z12","v":0},{"$f":"+'3) INPUT VENDITE'!AA12","v":0},0,null,{"$f":"+'3) INPUT VENDITE'!AD12","v":0},{"$f":"+'3) INPUT VENDITE'!AE12","v":0},{"$f":"+'3) INPUT VENDITE'!AF12","v":0},{"$f":"+'3) INPUT VENDITE'!AG12","v":0},{"$f":"+'3) INPUT VENDITE'!AH12","v":0},{"$f":"+'3) INPUT VENDITE'!AI12","v":0},{"$f":"+'3) INPUT VENDITE'!AJ12","v":0},{"$f":"+'3) INPUT VENDITE'!AK12","v":0},{"$f":"+'3) INPUT VENDITE'!AL12","v":0},{"$f":"+'3) INPUT VENDITE'!AM12","v":0},{"$f":"+'3) INPUT VENDITE'!AN12","v":0},{"$f":"+'3) INPUT VENDITE'!AO12","v":0},0]
[{"$f":"+'3) INPUT VENDITE'!A13","v":"Altri ricavi"},{"$f":"+'3) INPUT VENDITE'!B13","v":0},{"$f":"+'3) INPUT VENDITE'!C13","v":0},{"$f":"+'3) INPUT VENDITE'!D13","v":0},{"$f":"+'3) INPUT VENDITE'!E13","v":0},{"$f":"+'3) INPUT VENDITE'!F13","v":0},{"$f":"+'3) INPUT VENDITE'!G13","v":0},{"$f":"+'3) INPUT VENDITE'!H13","v":0},{"$f":"+'3) INPUT VENDITE'!I13","v":0},{"$f":"+'3) INPUT VENDITE'!J13","v":0},{"$f":"+'3) INPUT VENDITE'!K13","v":0},{"$f":"+'3) INPUT VENDITE'!L13","v":0},{"$f":"+'3) INPUT VENDITE'!M13","v":0},0,null,{"$f":"+'3) INPUT VENDITE'!P13","v":0},{"$f":"+'3) INPUT VENDITE'!Q13","v":0},{"$f":"+'3) INPUT VENDITE'!R13","v":0},{"$f":"+'3) INPUT VENDITE'!S13","v":0},{"$f":"+'3) INPUT VENDITE'!T13","v":0},{"$f":"+'3) INPUT VENDITE'!U13","v":0},{"$f":"+'3) INPUT VENDITE'!V13","v":0},{"$f":"+'3) INPUT VENDITE'!W13","v":0},{"$f":"+'3) INPUT VENDITE'!X13","v":0},{"$f":"+'3) INPUT VENDITE'!Y13","v":0},{"$f":"+'3) INPUT VENDITE'!Z13","v":0},{"$f":"+'3) INPUT VENDITE'!AA13","v":0},0,null,{"$f":"+'3) INPUT VENDITE'!AD13","v":0},{"$f":"+'3) INPUT VENDITE'!AE13","v":0},{"$f":"+'3) INPUT VENDITE'!AF13","v":0},{"$f":"+'3) INPUT VENDITE'!AG13","v":0},{"$f":"+'3) INPUT VENDITE'!AH13","v":0},{"$f":"+'3) INPUT VENDITE'!AI13","v":0},{"$f":"+'3) INPUT VENDITE'!AJ13","v":0},{"$f":"+'3) INPUT VENDITE'!AK13","v":0},{"$f":"+'3) INPUT VENDITE'!AL13","v":0},{"$f":"+'3) INPUT VENDITE'!AM13","v":0},{"$f":"+'3) INPUT VENDITE'!AN13","v":0},{"$f":"+'3) INPUT VENDITE'!AO13","v":0},0]
["EROGAZIONE FINANZIAMENTO",{"$f":"IF(A123=\"LEVERED\",'7) INPUT FINANZIAMENTO'!B11,0)","v":0},null,null,null,null,null,null,null,null,null,null,null,0,null,null,null,null,null,null,null,null,null,null,null,null,null,0,null,null,null,null,null,null,null,null,null,null,null,null,null,0]
["VERSAMENTO CAPITALE",{"$f":"IF($B$126=\"SI COMPENSA FLUSSI NEGATIVI CON CAPITALE\",IF(SUM(B5:B15)-B69-B106-B118-B121<0,-(SUM(B5:B15)-B69-B106-B118-C121),0),'7) INPUT FINANZIAMENTO'!B10)","v":7608},{"$f":"IF($B$126=\"SI COMPENSA FLUSSI NEGATIVI CON CAPITALE\",IF(SUM(C5:C15)-C69-C106-C118-C121<0,-(SUM(C5:C15)-C69-C106-C118-C121),0),0)","v":0},{"$f":"IF($B$126=\"SI COMPENSA FLUSSI NEGATIVI CON CAPITALE\",IF(SUM(D5:D15)-D69-D106-D118-D121<0,-(SUM(D5:D15)-D69-D106-D118-D121),0),0)","v":0},{"$f":"IF($B$126=\"SI COMPENSA FLUSSI NEGATIVI CON CAPITALE\",IF(SUM(E5:E15)-E69-E106-E118-E121<0,-(SUM(E5:E15)-E69-E106-E118-E121),0),0)","v":0},0,0,0,0,0,0,0,600.6,8208.6,0,8,0,0,0,0,0,0,180.19200000000001,0,0,0,600.6,788.79200000000003,0,8,0,0,0,0,0,0,0,0,0,0,600.6,608.6]
[{"$f":"+'3) INPUT VENDITE'!A14","v":"TOTALE"},{"$f":"SUM(B5:B16)","v":8208},{"$f":"SUM(C5:C16)","v":2170},{"$f":"SUM(D5:D16)","v":4860},5022,5022,2100,620,600,5022,620,560,1220.5999999999999,{"$f":"SUM(B17:M17)","v":36024.6},null,{"$f":"SUM(P5:P16)","v":608},{"$f":"SUM(Q5:Q16)","v":2170},4860,5022,5022,2100,620,780.19200000000001,5022,620,560,1220.5999999999999,{"$f":"SUM(P17:AA17)","v":28604.791999999998},null,{"$f":"SUM(AD5:AD16)","v":608},{"$f":"SUM(AE5:AE16)","v":2170},4860,5022,5022,2100,620,600,5022,620,560,1220.5999999999999,{"$f":"SUM(AD17:AO17)","v":28424.6}]
[]
["INVESTIMENTI IMMATERIALI",{"$f":"+B4","v":"2016-04-30"},"2016-05-31","2016-06-30","2016-07-31","2016-08-31","2016-09-30","2016-10-31","2016-11-30","2016-12-31","2017-01-31","2017-02-28","2017-03-31","TOTALE",null,{"$f":"+P4","v":"2017-04-30"},"2017-05-31","2017-06-30","2017-07-31","2017-08-31","2017-09-30","2017-10-31","2017-11-30","2017-12-31","2018-01-31","2018-02-28","2018-03-31","TOTALE",null,{"$f":"+AD4","v":"2018-04-30"},"2018-05-31","2018-06-30","2018-07-31","2018-08-31","2018-09-30","2018-10-31","2018-11-30","2018-12-31","2019-01-31","2019-02-28","2019-03-31","TOTALE"]
[{"$f":"+'2) INPUT INVESTIMENTI'!A9","v":"Costi di costituzione"},{"$f":"+'2) INPUT INVESTIMENTI'!D9","v":500},null,null,null,null,null,null,null,null,null,null,null,{"$f":"SUM(B20:M20)","v":500}]
[{"$f":"+'2) INPUT INVESTIMENTI'!A10","v":"Sito internet"},{"$f":"+'2) INPUT INVESTIMENTI'!D10","v":600},null,null,null,null,null,null,null,null,null,null,null,{"$f":"SUM(B21:M21)","v":600}]
[{"$f":"+'2) INPUT INVESTIMENTI'!A11","v":"Elaborazione business plan"},{"$f":"+'2) INPUT INVESTIMENTI'!D11","v":0},null,null,null,null,null,null,null,null,null,null,null,0]
[{"$f":"+'2) INPUT INVESTIMENTI'!A12","v":"Promozione pre avvio"},{"$f":"+'2) INPUT INVESTIMENTI'!D12","v":1000},null,null,null,null,null,null,null,null,null,null,null,1000]
[{"$f":"+'2) INPUT INVESTIMENTI'!A13","v":"Altri investimenti immateriali"},{"$f":"+'2) INPUT INVESTIMENTI'!D13","v":0},null,null,null,null,null,null,null,null,null,null,null,0]
[{"$f":"+'2) INPUT INVESTIMENTI'!A14","v":"Altri investimenti immateriali"},{"$f":"+'2) INPUT INVESTIMENTI'!D14","v":0},null,null,null,null,null,null,null,null,null,null,null,0]
[{"$f":"+'2) INPUT INVESTIMENTI'!A15","v":"Altri investimenti immateriali"},{"$f":"+'2) INPUT INVESTIMENTI'!D15","v":0},null,null,null,null,null,null,null,null,null,null,null,0]
[{"$f":"+'2) INPUT INVESTIMENTI'!A16","v":"Altri investimenti immateriali"},{"$f":"+'2) INPUT INVESTIMENTI'!D16","v":0},null,null,null,null,null,null,null,null,null,null,null,0]
[{"$f":"+'2) INPUT INVESTIMENTI'!A17","v":"Altri investimenti immateriali"},{"$f":"+'2) INPUT INVESTIMENTI'!D17","v":0},null,null,null,null,null,null,null,null,null,null,null,0]
[{"$f":"+'2) INPUT INVESTIMENTI'!A18","v":"Altri investimenti immateriali"},{"$f":"+'2) INPUT INVESTIMENTI'!D18","v":0},null,null,null,null,null,null,null,null,null,null,null,0]
[{"$f":"+'2) INPUT INVESTIMENTI'!A19","v":"Altri investimenti immateriali"},{"$f":"+'2) INPUT INVESTIMENTI'!D19","v":0},null,null,null,null,null,null,null,null,null,null,null,0]
["INVESTIMENTI MATERIALI"]
[{"$f":"+'2) INPUT INVESTIMENTI'!A21","v":"Insegne/targhe"},{"$f":"+'2) INPUT INVESTIMENTI'!D21","v":150},null,null,null,null,null,null,null,null,null,null,null,150]
[{"$f":"+'2) INPUT INVESTIMENTI'!A22","v":"Ristrutturazioni"},{"$f":"+'2) INPUT INVESTIMENTI'!D22","v":0},null,null,null,null,null,null,null,null,null,null,null,0]
[{"$f":"+'2) INPUT INVESTIMENTI'!A23","v":"Impianto climatizzazione"},{"$f":"+'2) INPUT INVESTIMENTI'!D23","v":2000},null,null,null,null,null,null,null,null,null,null,null,2000]
[{"$f":"+'2) INPUT INVESTIMENTI'!A24","v":"Impianto riscaldamenti"},{"$f":"+'2) INPUT INVESTIMENTI'!D24","v":0},null,null,null,null,null,null,null,null,null,null,null,0]
[{"$f":"+'2) INPUT INVESTIMENTI'!A25","v":"Arredo camere"},{"$f":"+'2) INPUT INVESTIMENTI'!D25","v":2000},null,null,null,null,null,null,null,null,null,null,null,2000]
[{"$f":"+'2) INPUT INVESTIMENTI'!A26","v":"Arredo salotto"},{"$f":"+'2) INPUT INVESTIMENTI'!D26","v":0},null,null,null,null,null,null,null,null,null,null,null,0]
[{"$f":"+'2) INPUT INVESTIMENTI'!A27","v":"Arredo cortile/area esterna"},{"$f":"+'2) INPUT INVESTIMENTI'!D27","v":0},null,null,null,null,null,null,null,null,null,null,null,0]
[{"$f":"+'2) INPUT INVESTIMENTI'!A28","v":"Arredo cucina"},{"$f":"+'2) INPUT INVESTIMENTI'!D28","v":0},null,null,null,null,null,null,null,null,null,null,null,0]
[{"$f":"+'2) INPUT INVESTIMENTI'!A29","v":"Arredo servizi igienici"},{"$f":"+'2) INPUT INVESTIMENTI'!D29","v":0},null,null,null,null,null,null,null,null,null,null,null,0]
[{"$f":"+'2) INPUT INVESTIMENTI'!A30","v":"Arredo ufficio/stanza titolare"},{"$f":"+'2) INPUT INVESTIMENTI'!D30","v":0},null,null,null,null,null,null,null,null,null,null,null,0]
[{"$f":"+'2) INPUT INVESTIMENTI'!A31","v":"Altro arredo locale"},{"$f":"+'2) INPUT INVESTIMENTI'!D31","v":0},null,null,null,null,null,null,null,null,null,null,null,0]
[{"$f":"+'2) INPUT INVESTIMENTI'!A32","v":"Cucina"},{"$f":"+'2) INPUT INVESTIMENTI'!D32","v":0},null,null,null,null,null,null,null,null,null,null,null,0]
[{"$f":"+'2) INPUT INVESTIMENTI'!A33","v":"Mobili cucina"},{"$f":"+'2) INPUT INVESTIMENTI'!D33","v":0},null,null,null,null,null,null,null,null,null,null,null,0]
[{"$f":"+'2) INPUT INVESTIMENTI'!A34","v":"Mobili cucina"},{"$f":"+'2) INPUT INVESTIMENTI'!D34","v":0},null,null,null,null,null,null,null,null,null,null,null,0]
[{"$f":"+'2) INPUT INVESTIMENTI'!A35","v":"Frigorifero"},{"$f":"+'2) INPUT INVESTIMENTI'!D35","v":0},null,null,null,null,null,null,null,null,null,null,null,0]
[{"$f":"+'2) INPUT INVESTIMENTI'!A36","v":"Altri elettrodomestici"},{"$f":"+'2) INPUT INVESTIMENTI'!D36","v":0},null,null,null,null,null,null,null,null,null,null,null,0]
[{"$f":"+'2) INPUT INVESTIMENTI'!A37","v":"Altri elettrodomestici"},{"$f":"+'2) INPUT INVESTIMENTI'!D37","v":0},null,null,null,null,null,null,null,null,null,null,null,0]
[{"$f":"+'2) INPUT INVESTIMENTI'!A38","v":"Altri elettrodomestici"},{"$f":"+'2) INPUT INVESTIMENTI'!D38","v":0},null,null,null,null,null,null,null,null,null,null,null,0]
[{"$f":"+'2) INPUT INVESTIMENTI'!A39","v":"Altri elettrodomestici"},{"$f":"+'2) INPUT INVESTIMENTI'!D39","v":0},null,null,null,null,null,null,null,null,null,null,null,0]
[{"$f":"+'2) INPUT INVESTIMENTI'!A40","v":"Utensili/Attrezzatura cucina"},{"$f":"+'2) INPUT INVESTIMENTI'!D40","v":100},null,null,null,null,null,null,null,null,null,null,null,100]
[{"$f":"+'2) INPUT INVESTIMENTI'!A41","v":"Biancheria per la casa"},{"$f":"+'2) INPUT INVESTIMENTI'!D41","v":500},null,null,null,null,null,null,null,null,null,null,null,500]
[{"$f":"+'2) INPUT INVESTIMENTI'!A42","v":"Strumenti per pulizia locali"},{"$f":"+'2) INPUT INVESTIMENTI'!D42","v":0},null,null,null,null,null,null,null,null,null,null,null,0]
[{"$f":"+'2) INPUT INVESTIMENTI'!A43","v":"Telefono fisso"},{"$f":"+'2) INPUT INVESTIMENTI'!D43","v":0},null,null,null,null,null,null,null,null,null,null,null,0]
[{"$f":"+'2) INPUT INVESTIMENTI'!A44","v":"Telefoni cellulari "},{"$f":"+'2) INPUT INVESTIMENTI'!D44","v":0},null,null,null,null,null,null,null,null,null,null,null,0]
[{"$f":"+'2) INPUT INVESTIMENTI'!A45","v":"Segreteria telefonica"},{"$f":"+'2) INPUT INVESTIMENTI'!D45","v":50},null,null,null,null,null,null,null,null,null,null,null,50]
[{"$f":"+'2) INPUT INVESTIMENTI'!A46","v":"Fax"},{"$f":"+'2) INPUT INVESTIMENTI'!D46","v":0},null,null,null,null,null,null,null,null,null,null,null,0]
[{"$f":"+'2) INPUT INVESTIMENTI'!A47","v":"Computer"},{"$f":"+'2) INPUT INVESTIMENTI'!D47","v":500},null,null,null,null,null,null,null,null,null,null,null,500]
[{"$f":"+'2) INPUT INVESTIMENTI'!A48","v":"Software"},{"$f":"+'2) INPUT INVESTIMENTI'!D48","v":100},null,null,null,null,null,null,null,null,null,null,null,100]
[{"$f":"+'2) INPUT INVESTIMENTI'!A49","v":"Stampante"},{"$f":"+'2) INPUT INVESTIMENTI'!D49","v":100},null,null,null,null,null,null,null,null,null,null,null,100]
[{"$f":"+'2) INPUT INVESTIMENTI'!A50","v":"Altre attrezzature"},{"$f":"+'2) INPUT INVESTIMENTI'!D50","v":0},null,null,null,null,null,null,null,null,null,null,null,0]
[{"$f":"+'2) INPUT INVESTIMENTI'!A51","v":"Altre attrezzature"},{"$f":"+'2) INPUT INVESTIMENTI'!D51","v":0},null,null,null,null,null,null,null,null,null,null,null,0]
[{"$f":"+'2) INPUT INVESTIMENTI'!A52","v":"Altre attrezzature"},{"$f":"+'2) INPUT INVESTIMENTI'!D52","v":0},null,null,null,null,null,null,null,null,null,null,null,0]
[{"$f":"+'2) INPUT INVESTIMENTI'!A53","v":"Altri investimenti materiali"},{"$f":"+'2) INPUT INVESTIMENTI'!D53","v":0},null,null,null,null,null,null,null,null,null,null,null,0]
[{"$f":"+'2) INPUT INVESTIMENTI'!A54","v":"Altri investimenti materiali"},{"$f":"+'2) INPUT INVESTIMENTI'!D54","v":0},null,null,null,null,null,null,null,null,null,null,null,0]
[{"$f":"+'2) INPUT INVESTIMENTI'!A55","v":"Altri investimenti materiali"},{"$f":"+'2) INPUT INVESTIMENTI'!D55","v":0},null,null,null,null,null,null,null,null,null,null,null,0]
[{"$f":"+'2) INPUT INVESTIMENTI'!A56","v":"Altri investimenti materiali"},{"$f":"+'2) INPUT INVESTIMENTI'!D56","v":0},null,null,null,null,null,null,null,null,null,null,null,0]
[{"$f":"+'2) INPUT INVESTIMENTI'!A57","v":"Altri investimenti materiali"},{"$f":"+'2) INPUT INVESTIMENTI'!D57","v":0},null,null,null,null,null,null,null,null,null,null,null,0]
["TOTALE",{"$f":"SUM(B20:B68)","v":7600},null,null,null,null,null,null,null,null,null,null,null,7600]
[]
["USCITE FISSE",{"$f":"+B4","v":"2016-04-30"},"2016-05-31","2016-06-30","2016-07-31","2016-08-31","2016-09-30","2016-10-31","2016-11-30","2016-12-31","2017-01-31","2017-02-28","2017-03-31","TOTALE",null,{"$f":"+P4","v":"2017-04-30"},"2017-05-31","2017-06-30","2017-07-31","2017-08-31","2017-09-30","2017-10-31","2017-11-30","2017-12-31","2018-01-31","2018-02-28","2018-03-31","TOTALE",null,{"$f":"+AD4","v":"2018-04-30"},"2018-05-31","2018-06-30","2018-07-31","2018-08-31","2018-09-30","2018-10-31","2018-11-30","2018-12-31","2019-01-31","2019-02-28","2019-03-31","TOTALE"]
[{"$f":"+'5) INPUT COSTI FISSI'!A3","v":"Contributi"},{"$f":"+'5) INPUT COSTI FISSI'!B3","v":0},{"$f":"+'5) INPUT COSTI FISSI'!C3","v":0},{"$f":"+'5) INPUT COSTI FISSI'!D3","v":0},{"$f":"+'5) INPUT COSTI FISSI'!E3","v":0},{"$f":"+'5) INPUT COSTI FISSI'!F3","v":0},{"$f":"+'5) INPUT COSTI FISSI'!G3","v":0},{"$f":"+'5) INPUT COSTI FISSI'!H3","v":0},{"$f":"+'5) INPUT COSTI FISSI'!I3","v":0},{"$f":"+'5) INPUT COSTI FISSI'!J3","v":0},{"$f":"+'5) INPUT COSTI FISSI'!K3","v":0},{"$f":"+'5) INPUT COSTI FISSI'!L3","v":0},{"$f":"+'5) INPUT COSTI FISSI'!M3","v":0},{"$f":"+'5) INPUT COSTI FISSI'!N3","v":0},null,{"$f":"+'5) INPUT COSTI FISSI'!P3","v":0},{"$f":"+'5) INPUT COSTI FISSI'!Q3","v":0},{"$f":"+'5) INPUT COSTI FISSI'!R3","v":0},{"$f":"+'5) INPUT COSTI FISSI'!S3","v":0},{"$f":"+'5) INPUT COSTI FISSI'!T3","v":0},{"$f":"+'5) INPUT COSTI FISSI'!U3","v":0},{"$f":"+'5) INPUT COSTI FISSI'!V3","v":0},{"$f":"+'5) INPUT COSTI FISSI'!W3","v":0},{"$f":"+'5) INPUT COSTI FISSI'!X3","v":0},{"$f":"+'5) INPUT COSTI FISSI'!Y3","v":0},{"$f":"+'5) INPUT COSTI FISSI'!Z3","v":0},{"$f":"+'5) INPUT COSTI FISSI'!AA3","v":0},{"$f":"+'5) INPUT COSTI FISSI'!AB3","v":0},null,{"$f":"+'5) INPUT COSTI FISSI'!AD3","v":0},{"$f":"+'5) INPUT COSTI FISSI'!AE3","v":0},{"$f":"+'5) INPUT COSTI FISSI'!AF3","v":0},{"$f":"+'5) INPUT COSTI FISSI'!AG3","v":0},{"$f":"+'5) INPUT COSTI FISSI'!AH3","v":0},{"$f":"+'5) INPUT COSTI FISSI'!AI3","v":0},{"$f":"+'5) INPUT COSTI FISSI'!AJ3","v":0},{"$f":"+'5) INPUT COSTI FISSI'!AK3","v":0},{"$f":"+'5) INPUT COSTI FISSI'!AL3","v":0},{"$f":"+'5) INPUT COSTI FISSI'!AM3","v":0},{"$f":"+'5) INPUT COSTI FISSI'!AN3","v":0},{"$f":"+'5) INPUT COSTI FISSI'!AO3","v":0},{"$f":"+'5) INPUT COSTI FISSI'!AP3","v":0}]
[{"$f":"+'5) INPUT COSTI FISSI'!A4","v":"Imposta di registro"},{"$f":"+'5) INPUT COSTI FISSI'!B4","v":0},{"$f":"+'5) INPUT COSTI FISSI'!C4","v":0},{"$f":"+'5) INPUT COSTI FISSI'!D4","v":0},{"$f":"+'5) INPUT COSTI FISSI'!E4","v":0},{"$f":"+'5) INPUT COSTI FISSI'!F4","v":0},{"$f":"+'5) INPUT COSTI FISSI'!G4","v":0},{"$f":"+'5) INPUT COSTI FISSI'!H4","v":0},{"$f":"+'5) INPUT COSTI FISSI'!I4","v":0},{"$f":"+'5) INPUT COSTI FISSI'!J4","v":0},{"$f":"+'5) INPUT COSTI FISSI'!K4","v":0},{"$f":"+'5) INPUT COSTI FISSI'!L4","v":0},{"$f":"+'5) INPUT COSTI FISSI'!M4","v":0},{"$f":"+'5) INPUT COSTI FISSI'!N4","v":0},null,{"$f":"+'5) INPUT COSTI FISSI'!P4","v":0},{"$f":"+'5) INPUT COSTI FISSI'!Q4","v":0},{"$f":"+'5) INPUT COSTI FISSI'!R4","v":0},{"$f":"+'5) INPUT COSTI FISSI'!S4","v":0},{"$f":"+'5) INPUT COSTI FISSI'!T4","v":0},{"$f":"+'5) INPUT COSTI FISSI'!U4","v":0},{"$f":"+'5) INPUT COSTI FISSI'!V4","v":0},{"$f":"+'5) INPUT COSTI FISSI'!W4","v":0},{"$f":"+'5) INPUT COSTI FISSI'!X4","v":0},{"$f":"+'5) INPUT COSTI FISSI'!Y4","v":0},{"$f":"+'5) INPUT COSTI FISSI'!Z4","v":0},{"$f":"+'5) INPUT COSTI FISSI'!AA4","v":0},{"$f":"+'5) INPUT COSTI FISSI'!AB4","v":0},null,{"$f":"+'5) INPUT COSTI FISSI'!AD4","v":0},{"$f":"+'5) INPUT COSTI FISSI'!AE4","v":0},{"$f":"+'5) INPUT COSTI FISSI'!AF4","v":0},{"$f":"+'5) INPUT COSTI FISSI'!AG4","v":0},{"$f":"+'5) INPUT COSTI FISSI'!AH4","v":0},{"$f":"+'5) INPUT COSTI FISSI'!AI4","v":0},{"$f":"+'5) INPUT COSTI FISSI'!AJ4","v":0},{"$f":"+'5) INPUT COSTI FISSI'!AK4","v":0},{"$f":"+'5) INPUT COSTI FISSI'!AL4","v":0},{"$f":"+'5) INPUT COSTI FISSI'!AM4","v":0},{"$f":"+'5) INPUT COSTI FISSI'!AN4","v":0},{"$f":"+'5) INPUT COSTI FISSI'!AO4","v":0},{"$f":"+'5) INPUT COSTI FISSI'!AP4","v":0}]
[{"$f":"+'5) INPUT COSTI FISSI'!A5","v":"Affitto"},{"$f":"+'5) INPUT COSTI FISSI'!B5","v":0},{"$f":"+'5) INPUT COSTI FISSI'!C5","v":0},{"$f":"+'5) INPUT COSTI FISSI'!D5","v":0},{"$f":"+'5) INPUT COSTI FISSI'!E5","v":0},{"$f":"+'5) INPUT COSTI FISSI'!F5","v":0},{"$f":"+'5) INPUT COSTI FISSI'!G5","v":0},{"$f":"+'5) INPUT COSTI FISSI'!H5","v":0},{"$f":"+'5) INPUT COSTI FISSI'!I5","v":0},{"$f":"+'5) INPUT COSTI FISSI'!J5","v":0},{"$f":"+'5) INPUT COSTI FISSI'!K5","v":0},{"$f":"+'5) INPUT COSTI FISSI'!L5","v":0},{"$f":"+'5) INPUT COSTI FISSI'!M5","v":0},{"$f":"+'5) INPUT COSTI FISSI'!N5","v":0},null,{"$f":"+'5) INPUT COSTI FISSI'!P5","v":0},{"$f":"+'5) INPUT COSTI FISSI'!Q5","v":0},{"$f":"+'5) INPUT COSTI FISSI'!R5","v":0},{"$f":"+'5) INPUT COSTI FISSI'!S5","v":0},{"$f":"+'5) INPUT COSTI FISSI'!T5","v":0},{"$f":"+'5) INPUT COSTI FISSI'!U5","v":0},{"$f":"+'5) INPUT COSTI FISSI'!V5","v":0},{"$f":"+'5) INPUT COSTI FISSI'!W5","v":0},{"$f":"+'5) INPUT COSTI FISSI'!X5","v":0},{"$f":"+'5) INPUT COSTI FISSI'!Y5","v":0},{"$f":"+'5) INPUT COSTI FISSI'!Z5","v":0},{"$f":"+'5) INPUT COSTI FISSI'!AA5","v":0},{"$f":"+'5) INPUT COSTI FISSI'!AB5","v":0},null,{"$f":"+'5) INPUT COSTI FISSI'!AD5","v":0},{"$f":"+'5) INPUT COSTI FISSI'!AE5","v":0},{"$f":"+'5) INPUT COSTI FISSI'!AF5","v":0},{"$f":"+'5) INPUT COSTI FISSI'!AG5","v":0},{"$f":"+'5) INPUT COSTI FISSI'!AH5","v":0},{"$f":"+'5) INPUT COSTI FISSI'!AI5","v":0},{"$f":"+'5) INPUT COSTI FISSI'!AJ5","v":0},{"$f":"+'5) INPUT COSTI FISSI'!AK5","v":0},{"$f":"+'5) INPUT COSTI FISSI'!AL5","v":0},{"$f":"+'5) INPUT COSTI FISSI'!AM5","v":0},{"$f":"+'5) INPUT COSTI FISSI'!AN5","v":0},{"$f":"+'5) INPUT COSTI FISSI'!AO5","v":0},{"$f":"+'5) INPUT COSTI FISSI'!AP5","v":0}]
[{"$f":"+'5) INPUT COSTI FISSI'!A6","v":"Condominio"},{"$f":"+'5) INPUT COSTI FISSI'!B6","v":100},{"$f":"+'5) INPUT COSTI FISSI'!C6","v":100},{"$f":"+'5) INPUT COSTI FISSI'!D6","v":100},{"$f":"+'5) INPUT COSTI FISSI'!E6","v":100},{"$f":"+'5) INPUT COSTI FISSI'!F6","v":100},{"$f":"+'5) INPUT COSTI FISSI'!G6","v":100},{"$f":"+'5) INPUT COSTI FISSI'!H6","v":100},{"$f":"+'5) INPUT COSTI FISSI'!I6","v":100},{"$f":"+'5) INPUT COSTI FISSI'!J6","v":100},{"$f":"+'5) INPUT COSTI FISSI'!K6","v":100},{"$f":"+'5) INPUT COSTI FISSI'!L6","v":100},{"$f":"+'5) INPUT COSTI FISSI'!M6","v":100},{"$f":"+'5) INPUT COSTI FISSI'!N6","v":1200},null,{"$f":"+'5) INPUT COSTI FISSI'!P6","v":100},{"$f":"+'5) INPUT COSTI FISSI'!Q6","v":100},{"$f":"+'5) INPUT COSTI FISSI'!R6","v":100},{"$f":"+'5) INPUT COSTI FISSI'!S6","v":100},{"$f":"+'5) INPUT COSTI FISSI'!T6","v":100},{"$f":"+'5) INPUT COSTI FISSI'!U6","v":100},{"$f":"+'5) INPUT COSTI FISSI'!V6","v":100},{"$f":"+'5) INPUT COSTI FISSI'!W6","v":100},{"$f":"+'5) INPUT COSTI FISSI'!X6","v":100},{"$f":"+'5) INPUT COSTI FISSI'!Y6","v":100},{"$f":"+'5) INPUT COSTI FISSI'!Z6","v":100},{"$f":"+'5) INPUT COSTI FISSI'!AA6","v":100},{"$f":"+'5) INPUT COSTI FISSI'!AB6","v":1200},null,{"$f":"+'5) INPUT COSTI FISSI'!AD6","v":100},{"$f":"+'5) INPUT COSTI FISSI'!AE6","v":100},{"$f":"+'5) INPUT COSTI FISSI'!AF6","v":100},{"$f":"+'5) INPUT COSTI FISSI'!AG6","v":100},{"$f":"+'5) INPUT COSTI FISSI'!AH6","v":100},{"$f":"+'5) INPUT COSTI FISSI'!AI6","v":100},{"$f":"+'5) INPUT COSTI FISSI'!AJ6","v":100},{"$f":"+'5) INPUT COSTI FISSI'!AK6","v":100},{"$f":"+'5) INPUT COSTI FISSI'!AL6","v":100},{"$f":"+'5) INPUT COSTI FISSI'!AM6","v":100},{"$f":"+'5) INPUT COSTI FISSI'!AN6","v":100},{"$f":"+'5) INPUT COSTI FISSI'!AO6","v":100},{"$f":"+'5) INPUT COSTI FISSI'!AP6","v":1200}]
[{"$f":"+'5) INPUT COSTI FISSI'!A7","v":"Collaboratori occasionali/stagionali"},{"$f":"+'5) INPUT COSTI FISSI'!B7","v":0},{"$f":"+'5) INPUT COSTI FISSI'!C7","v":0},{"$f":"+'5) INPUT COSTI FISSI'!D7","v":0},{"$f":"+'5) INPUT COSTI FISSI'!E7","v":0},{"$f":"+'5) INPUT COSTI FISSI'!F7","v":0},{"$f":"+'5) INPUT COSTI FISSI'!G7","v":0},{"$f":"+'5) INPUT COSTI FISSI'!H7","v":0},{"$f":"+'5) INPUT COSTI FISSI'!I7","v":0},{"$f":"+'5) INPUT COSTI FISSI'!J7","v":0},{"$f":"+'5) INPUT COSTI FISSI'!K7","v":0},{"$f":"+'5) INPUT COSTI FISSI'!L7","v":0},{"$f":"+'5) INPUT COSTI FISSI'!M7","v":0},{"$f":"+'5) INPUT COSTI FISSI'!N7","v":0},null,{"$f":"+'5) INPUT COSTI FISSI'!P7","v":0},{"$f":"+'5) INPUT COSTI FISSI'!Q7","v":0},{"$f":"+'5) INPUT COSTI FISSI'!R7","v":0},{"$f":"+'5) INPUT COSTI FISSI'!S7","v":0},{"$f":"+'5) INPUT COSTI FISSI'!T7","v":0},{"$f":"+'5) INPUT COSTI FISSI'!U7","v":0},{"$f":"+'5) INPUT COSTI FISSI'!V7","v":0},{"$f":"+'5) INPUT COSTI FISSI'!W7","v":0},{"$f":"+'5) INPUT COSTI FISSI'!X7","v":0},{"$f":"+'5) INPUT COSTI FISSI'!Y7","v":0},{"$f":"+'5) INPUT COSTI FISSI'!Z7","v":0},{"$f":"+'5) INPUT COSTI FISSI'!AA7","v":0},{"$f":"+'5) INPUT COSTI FISSI'!AB7","v":0},null,{"$f":"+'5) INPUT COSTI FISSI'!AD7","v":0},{"$f":"+'5) INPUT COSTI FISSI'!AE7","v":0},{"$f":"+'5) INPUT COSTI FISSI'!AF7","v":0},{"$f":"+'5) INPUT COSTI FISSI'!AG7","v":0},{"$f":"+'5) INPUT COSTI FISSI'!AH7","v":0},{"$f":"+'5) INPUT COSTI FISSI'!AI7","v":0},{"$f":"+'5) INPUT COSTI FISSI'!AJ7","v":0},{"$f":"+'5) INPUT COSTI FISSI'!AK7","v":0},{"$f":"+'5) INPUT COSTI FISSI'!AL7","v":0},{"$f":"+'5) INPUT COSTI FISSI'!AM7","v":0},{"$f":"+'5) INPUT COSTI FISSI'!AN7","v":0},{"$f":"+'5) INPUT COSTI FISSI'!AO7","v":0},{"$f":"+'5) INPUT COSTI FISSI'!AP7","v":0}]
[{"$f":"+'5) INPUT COSTI FISSI'!A8","v":"Commercialista, consulente del lavoro, legale"},{"$f":"+'5) INPUT COSTI FISSI'!B8","v":0},{"$f":"+'5) INPUT COSTI FISSI'!C8","v":0},{"$f":"+'5) INPUT COSTI FISSI'!D8","v":0},{"$f":"+'5) INPUT COSTI FISSI'!E8","v":0},{"$f":"+'5) INPUT COSTI FISSI'!F8","v":0},{"$f":"+'5) INPUT COSTI FISSI'!G8","v":0},{"$f":"+'5) INPUT COSTI FISSI'!H8","v":0},{"$f":"+'5) INPUT COSTI FISSI'!I8","v":0},{"$f":"+'5) INPUT COSTI FISSI'!J8","v":0},{"$f":"+'5) INPUT COSTI FISSI'!K8","v":0},{"$f":"+'5) INPUT COSTI FISSI'!L8","v":0},{"$f":"+'5) INPUT COSTI FISSI'!M8","v":150},{"$f":"+'5) INPUT COSTI FISSI'!N8","v":150},null,{"$f":"+'5) INPUT COSTI FISSI'!P8","v":0},{"$f":"+'5) INPUT COSTI FISSI'!Q8","v":0},{"$f":"+'5) INPUT COSTI FISSI'!R8","v":0},{"$f":"+'5) INPUT COSTI FISSI'!S8","v":0},{"$f":"+'5) INPUT COSTI FISSI'!T8","v":0},{"$f":"+'5) INPUT COSTI FISSI'!U8","v":0},{"$f":"+'5) INPUT COSTI FISSI'!V8","v":0},{"$f":"+'5) INPUT COSTI FISSI'!W8","v":0},{"$f":"+'5) INPUT COSTI FISSI'!X8","v":0},{"$f":"+'5) INPUT COSTI FISSI'!Y8","v":0},{"$f":"+'5) INPUT COSTI FISSI'!Z8","v":0},{"$f":"+'5) INPUT COSTI FISSI'!AA8","v":150},{"$f":"+'5) INPUT COSTI FISSI'!AB8","v":150},null,{"$f":"+'5) INPUT COSTI FISSI'!AD8","v":0},{"$f":"+'5) INPUT COSTI FISSI'!AE8","v":0},{"$f":"+'5) INPUT COSTI FISSI'!AF8","v":0},{"$f":"+'5) INPUT COSTI FISSI'!AG8","v":0},{"$f":"+'5) INPUT COSTI FISSI'!AH8","v":0},{"$f":"+'5) INPUT COSTI FISSI'!AI8","v":0},{"$f":"+'5) INPUT COSTI FISSI'!AJ8","v":0},{"$f":"+'5) INPUT COSTI FISSI'!AK8","v":0},{"$f":"+'5) INPUT COSTI FISSI'!AL8","v":0},{"$f":"+'5) INPUT COSTI FISSI'!AM8","v":0},{"$f":"+'5) INPUT COSTI FISSI'!AN8","v":0},{"$f":"+'5) INPUT COSTI FISSI'!AO8","v":150},{"$f":"+'5) INPUT COSTI FISSI'!AP8","v":150}]
[{"$f":"+'5) INPUT COSTI FISSI'!A9","v":"Promozione post avvio"},{"$f":"+'5) INPUT COSTI FISSI'!B9","v":100},{"$f":"+'5) INPUT COSTI FISSI'!C9","v":100},{"$f":"+'5) INPUT COSTI FISSI'!D9","v":100},{"$f":"+'5) INPUT COSTI FISSI'!E9","v":100},{"$f":"+'5) INPUT COSTI FISSI'!F9","v":100},{"$f":"+'5) INPUT COSTI FISSI'!G9","v":100},{"$f":"+'5) INPUT COSTI FISSI'!H9","v":100},{"$f":"+'5) INPUT COSTI FISSI'!I9","v":100},{"$f":"+'5) INPUT COSTI FISSI'!J9","v":100},{"$f":"+'5) INPUT COSTI FISSI'!K9","v":100},{"$f":"+'5) INPUT COSTI FISSI'!L9","v":100},{"$f":"+'5) INPUT COSTI FISSI'!M9","v":100},{"$f":"+'5) INPUT COSTI FISSI'!N9","v":1200},null,{"$f":"+'5) INPUT COSTI FISSI'!P9","v":100},{"$f":"+'5) INPUT COSTI FISSI'!Q9","v":100},{"$f":"+'5) INPUT COSTI FISSI'!R9","v":100},{"$f":"+'5) INPUT COSTI FISSI'!S9","v":100},{"$f":"+'5) INPUT COSTI FISSI'!T9","v":100},{"$f":"+'5) INPUT COSTI FISSI'!U9","v":100},{"$f":"+'5) INPUT COSTI FISSI'!V9","v":100},{"$f":"+'5) INPUT COSTI FISSI'!W9","v":100},{"$f":"+'5) INPUT COSTI FISSI'!X9","v":100},{"$f":"+'5) INPUT COSTI FISSI'!Y9","v":100},{"$f":"+'5) INPUT COSTI FISSI'!Z9","v":100},{"$f":"+'5) INPUT COSTI FISSI'!AA9","v":100},{"$f":"+'5) INPUT COSTI FISSI'!AB9","v":1200},null,{"$f":"+'5) INPUT COSTI FISSI'!AD9","v":100},{"$f":"+'5) INPUT COSTI FISSI'!AE9","v":100},{"$f":"+'5) INPUT COSTI FISSI'!AF9","v":100},{"$f":"+'5) INPUT COSTI FISSI'!AG9","v":100},{"$f":"+'5) INPUT COSTI FISSI'!AH9","v":100},{"$f":"+'5) INPUT COSTI FISSI'!AI9","v":100},{"$f":"+'5) INPUT COSTI FISSI'!AJ9","v":100},{"$f":"+'5) INPUT COSTI FISSI'!AK9","v":100},{"$f":"+'5) INPUT COSTI FISSI'!AL9","v":100},{"$f":"+'5) INPUT COSTI FISSI'!AM9","v":100},{"$f":"+'5) INPUT COSTI FISSI'!AN9","v":100},{"$f":"+'5) INPUT COSTI FISSI'!AO9","v":100},{"$f":"+'5) INPUT COSTI FISSI'!AP9","v":1200}]
[{"$f":"+'5) INPUT COSTI FISSI'!A10","v":"Dominio, hosting e manutenzione sito internet"},{"$f":"+'5) INPUT COSTI FISSI'!B10","v":0},{"$f":"+'5) INPUT COSTI FISSI'!C10","v":0},{"$f":"+'5) INPUT COSTI FISSI'!D10","v":0},{"$f":"+'5) INPUT COSTI FISSI'!E10","v":0},{"$f":"+'5) INPUT COSTI FISSI'!F10","v":0},{"$f":"+'5) INPUT COSTI FISSI'!G10","v":0},{"$f":"+'5) INPUT COSTI FISSI'!H10","v":0},{"$f":"+'5) INPUT COSTI FISSI'!I10","v":0},{"$f":"+'5) INPUT COSTI FISSI'!J10","v":0},{"$f":"+'5) INPUT COSTI FISSI'!K10","v":0},{"$f":"+'5) INPUT COSTI FISSI'!L10","v":0},{"$f":"+'5) INPUT COSTI FISSI'!M10","v":100},{"$f":"+'5) INPUT COSTI FISSI'!N10","v":100},null,{"$f":"+'5) INPUT COSTI FISSI'!P10","v":0},{"$f":"+'5) INPUT COSTI FISSI'!Q10","v":0},{"$f":"+'5) INPUT COSTI FISSI'!R10","v":0},{"$f":"+'5) INPUT COSTI FISSI'!S10","v":0},{"$f":"+'5) INPUT COSTI FISSI'!T10","v":0},{"$f":"+'5) INPUT COSTI FISSI'!U10","v":0},{"$f":"+'5) INPUT COSTI FISSI'!V10","v":0},{"$f":"+'5) INPUT COSTI FISSI'!W10","v":0},{"$f":"+'5) INPUT COSTI FISSI'!X10","v":0},{"$f":"+'5) INPUT COSTI FISSI'!Y10","v":0},{"$f":"+'5) INPUT COSTI FISSI'!Z10","v":0},{"$f":"+'5) INPUT COSTI FISSI'!AA10","v":100},{"$f":"+'5) INPUT COSTI FISSI'!AB10","v":100},null,{"$f":"+'5) INPUT COSTI FISSI'!AD10","v":0},{"$f":"+'5) INPUT COSTI FISSI'!AE10","v":0},{"$f":"+'5) INPUT COSTI FISSI'!AF10","v":0},{"$f":"+'5) INPUT COSTI FISSI'!AG10","v":0},{"$f":"+'5) INPUT COSTI FISSI'!AH10","v":0},{"$f":"+'5) INPUT COSTI FISSI'!AI10","v":0},{"$f":"+'5) INPUT COSTI FISSI'!AJ10","v":0},{"$f":"+'5) INPUT COSTI FISSI'!AK10","v":0},{"$f":"+'5) INPUT COSTI FISSI'!AL10","v":0},{"$f":"+'5) INPUT COSTI FISSI'!AM10","v":0},{"$f":"+'5) INPUT COSTI FISSI'!AN10","v":0},{"$f":"+'5) INPUT COSTI FISSI'!AO10","v":100},{"$f":"+'5) INPUT COSTI FISSI'!AP10","v":100}]
[{"$f":"+'5) INPUT COSTI FISSI'!A11","v":"Noleggio POS"},{"$f":"+'5) INPUT COSTI FISSI'!B11","v":0},{"$f":"+'5) INPUT COSTI FISSI'!C11","v":0},{"$f":"+'5) INPUT COSTI FISSI'!D11","v":0},{"$f":"+'5) INPUT COSTI FISSI'!E11","v":0},{"$f":"+'5) INPUT COSTI FISSI'!F11","v":0},{"$f":"+'5) INPUT COSTI FISSI'!G11","v":0},{"$f":"+'5) INPUT COSTI FISSI'!H11","v":0},{"$f":"+'5) INPUT COSTI FISSI'!I11","v":0},{"$f":"+'5) INPUT COSTI FISSI'!J11","v":0},{"$f":"+'5) INPUT COSTI FISSI'!K11","v":0},{"$f":"+'5) INPUT COSTI FISSI'!L11","v":0},{"$f":"+'5) INPUT COSTI FISSI'!M11","v":0},{"$f":"+'5) INPUT COSTI FISSI'!N11","v":0},null,{"$f":"+'5) INPUT COSTI FISSI'!P11","v":0},{"$f":"+'5) INPUT COSTI FISSI'!Q11","v":0},{"$f":"+'5) INPUT COSTI FISSI'!R11","v":0},{"$f":"+'5) INPUT COSTI FISSI'!S11","v":0},{"$f":"+'5) INPUT COSTI FISSI'!T11","v":0},{"$f":"+'5) INPUT COSTI FISSI'!U11","v":0},{"$f":"+'5) INPUT COSTI FISSI'!V11","v":0},{"$f":"+'5) INPUT COSTI FISSI'!W11","v":0},{"$f":"+'5) INPUT COSTI FISSI'!X11","v":0},{"$f":"+'5) INPUT COSTI FISSI'!Y11","v":0},{"$f":"+'5) INPUT COSTI FISSI'!Z11","v":0},{"$f":"+'5) INPUT COSTI FISSI'!AA11","v":0},{"$f":"+'5) INPUT COSTI FISSI'!AB11","v":0},null,{"$f":"+'5) INPUT COSTI FISSI'!AD11","v":0},{"$f":"+'5) INPUT COSTI FISSI'!AE11","v":0},{"$f":"+'5) INPUT COSTI FISSI'!AF11","v":0},{"$f":"+'5) INPUT COSTI FISSI'!AG11","v":0},{"$f":"+'5) INPUT COSTI FISSI'!AH11","v":0},{"$f":"+'5) INPUT COSTI FISSI'!AI11","v":0},{"$f":"+'5) INPUT COSTI FISSI'!AJ11","v":0},{"$f":"+'5) INPUT COSTI FISSI'!AK11","v":0},{"$f":"+'5) INPUT COSTI FISSI'!AL11","v":0},{"$f":"+'5) INPUT COSTI FISSI'!AM11","v":0},{"$f":"+'5) INPUT COSTI FISSI'!AN11","v":0},{"$f":"+'5) INPUT COSTI FISSI'!AO11","v":0},{"$f":"+'5) INPUT COSTI FISSI'!AP11","v":0}]
[{"$f":"+'5) INPUT COSTI FISSI'!A12","v":"Manutenzioni e riparazioni"},{"$f":"+'5) INPUT COSTI FISSI'!B12","v":0},{"$f":"+'5) INPUT COSTI FISSI'!C12","v":0},{"$f":"+'5) INPUT COSTI FISSI'!D12","v":0},{"$f":"+'5) INPUT COSTI FISSI'!E12","v":0},{"$f":"+'5) INPUT COSTI FISSI'!F12","v":0},{"$f":"+'5) INPUT COSTI FISSI'!G12","v":0},{"$f":"+'5) INPUT COSTI FISSI'!H12","v":0},{"$f":"+'5) INPUT COSTI FISSI'!I12","v":0},{"$f":"+'5) INPUT COSTI FISSI'!J12","v":0},{"$f":"+'5) INPUT COSTI FISSI'!K12","v":0},{"$f":"+'5) INPUT COSTI FISSI'!L12","v":0},{"$f":"+'5) INPUT COSTI FISSI'!M12","v":500},{"$f":"+'5) INPUT COSTI FISSI'!N12","v":500},null,{"$f":"+'5) INPUT COSTI FISSI'!P12","v":0},{"$f":"+'5) INPUT COSTI FISSI'!Q12","v":0},{"$f":"+'5) INPUT COSTI FISSI'!R12","v":0},{"$f":"+'5) INPUT COSTI FISSI'!S12","v":0},{"$f":"+'5) INPUT COSTI FISSI'!T12","v":0},{"$f":"+'5) INPUT COSTI FISSI'!U12","v":0},{"$f":"+'5) INPUT COSTI FISSI'!V12","v":0},{"$f":"+'5) INPUT COSTI FISSI'!W12","v":0},{"$f":"+'5) INPUT COSTI FISSI'!X12","v":0},{"$f":"+'5) INPUT COSTI FISSI'!Y12","v":0},{"$f":"+'5) INPUT COSTI FISSI'!Z12","v":0},{"$f":"+'5) INPUT COSTI FISSI'!AA12","v":500},{"$f":"+'5) INPUT COSTI FISSI'!AB12","v":500},null,{"$f":"+'5) INPUT COSTI FISSI'!AD12","v":0},{"$f":"+'5) INPUT COSTI FISSI'!AE12","v":0},{"$f":"+'5) INPUT COSTI FISSI'!AF12","v":0},{"$f":"+'5) INPUT COSTI FISSI'!AG12","v":0},{"$f":"+'5) INPUT COSTI FISSI'!AH12","v":0},{"$f":"+'5) INPUT COSTI FISSI'!AI12","v":0},{"$f":"+'5) INPUT COSTI FISSI'!AJ12","v":0},{"$f":"+'5) INPUT COSTI FISSI'!AK12","v":0},{"$f":"+'5) INPUT COSTI FISSI'!AL12","v":0},{"$f":"+'5) INPUT COSTI FISSI'!AM12","v":0},{"$f":"+'5) INPUT COSTI FISSI'!AN12","v":0},{"$f":"+'5) INPUT COSTI FISSI'!AO12","v":500},{"$f":"+'5) INPUT COSTI FISSI'!AP12","v":500}]
[{"$f":"+'5) INPUT COSTI FISSI'!A13","v":"Energia elettrica"},{"$f":"+'5) INPUT COSTI FISSI'!B13","v":0},{"$f":"+'5) INPUT COSTI FISSI'!C13","v":100},{"$f":"+'5) INPUT COSTI FISSI'!D13","v":0},{"$f":"+'5) INPUT COSTI FISSI'!E13","v":100},{"$f":"+'5) INPUT COSTI FISSI'!F13","v":0},{"$f":"+'5) INPUT COSTI FISSI'!G13","v":100},{"$f":"+'5) INPUT COSTI FISSI'!H13","v":0},{"$f":"+'5) INPUT COSTI FISSI'!I13","v":100},{"$f":"+'5) INPUT COSTI FISSI'!J13","v":0},{"$f":"+'5) INPUT COSTI FISSI'!K13","v":100},{"$f":"+'5) INPUT COSTI FISSI'!L13","v":0},{"$f":"+'5) INPUT COSTI FISSI'!M13","v":100},{"$f":"+'5) INPUT COSTI FISSI'!N13","v":600},null,{"$f":"+'5) INPUT COSTI FISSI'!P13","v":0},{"$f":"+'5) INPUT COSTI FISSI'!Q13","v":100},{"$f":"+'5) INPUT COSTI FISSI'!R13","v":0},{"$f":"+'5) INPUT COSTI FISSI'!S13","v":100},{"$f":"+'5) INPUT COSTI FISSI'!T13","v":0},{"$f":"+'5) INPUT COSTI FISSI'!U13","v":100},{"$f":"+'5) INPUT COSTI FISSI'!V13","v":0},{"$f":"+'5) INPUT COSTI FISSI'!W13","v":100},{"$f":"+'5) INPUT COSTI FISSI'!X13","v":0},{"$f":"+'5) INPUT COSTI FISSI'!Y13","v":100},{"$f":"+'5) INPUT COSTI FISSI'!Z13","v":0},{"$f":"+'5) INPUT COSTI FISSI'!AA13","v":100},{"$f":"+'5) INPUT COSTI FISSI'!AB13","v":600},null,{"$f":"+'5) INPUT COSTI FISSI'!AD13","v":0},{"$f":"+'5) INPUT COSTI FISSI'!AE13","v":100},{"$f":"+'5) INPUT COSTI FISSI'!AF13","v":0},{"$f":"+'5) INPUT COSTI FISSI'!AG13","v":100},{"$f":"+'5) INPUT COSTI FISSI'!AH13","v":0},{"$f":"+'5) INPUT COSTI FISSI'!AI13","v":100},{"$f":"+'5) INPUT COSTI FISSI'!AJ13","v":0},{"$f":"+'5) INPUT COSTI FISSI'!AK13","v":100},{"$f":"+'5) INPUT COSTI FISSI'!AL13","v":0},{"$f":"+'5) INPUT COSTI FISSI'!AM13","v":100},{"$f":"+'5) INPUT COSTI FISSI'!AN13","v":0},{"$f":"+'5) INPUT COSTI FISSI'!AO13","v":100},{"$f":"+'5) INPUT COSTI FISSI'!AP13","v":600}]
[{"$f":"+'5) INPUT COSTI FISSI'!A14","v":"Spese telefoniche/Internet"},{"$f":"+'5) INPUT COSTI FISSI'!B14","v":30},{"$f":"+'5) INPUT COSTI FISSI'!C14","v":30},{"$f":"+'5) INPUT COSTI FISSI'!D14","v":30},{"$f":"+'5) INPUT COSTI FISSI'!E14","v":30},{"$f":"+'5) INPUT COSTI FISSI'!F14","v":30},{"$f":"+'5) INPUT COSTI FISSI'!G14","v":30},{"$f":"+'5) INPUT COSTI FISSI'!H14","v":30},{"$f":"+'5) INPUT COSTI FISSI'!I14","v":30},{"$f":"+'5) INPUT COSTI FISSI'!J14","v":30},{"$f":"+'5) INPUT COSTI FISSI'!K14","v":30},{"$f":"+'5) INPUT COSTI FISSI'!L14","v":30},{"$f":"+'5) INPUT COSTI FISSI'!M14","v":30},{"$f":"+'5) INPUT COSTI FISSI'!N14","v":360},null,{"$f":"+'5) INPUT COSTI FISSI'!P14","v":30},{"$f":"+'5) INPUT COSTI FISSI'!Q14","v":30},{"$f":"+'5) INPUT COSTI FISSI'!R14","v":30},{"$f":"+'5) INPUT COSTI FISSI'!S14","v":30},{"$f":"+'5) INPUT COSTI FISSI'!T14","v":30},{"$f":"+'5) INPUT COSTI FISSI'!U14","v":30},{"$f":"+'5) INPUT COSTI FISSI'!V14","v":30},{"$f":"+'5) INPUT COSTI FISSI'!W14","v":30},{"$f":"+'5) INPUT COSTI FISSI'!X14","v":30},{"$f":"+'5) INPUT COSTI FISSI'!Y14","v":30},{"$f":"+'5) INPUT COSTI FISSI'!Z14","v":30},{"$f":"+'5) INPUT COSTI FISSI'!AA14","v":30},{"$f":"+'5) INPUT COSTI FISSI'!AB14","v":360},null,{"$f":"+'5) INPUT COSTI FISSI'!AD14","v":30},{"$f":"+'5) INPUT COSTI FISSI'!AE14","v":30},{"$f":"+'5) INPUT COSTI FISSI'!AF14","v":30},{"$f":"+'5) INPUT COSTI FISSI'!AG14","v":30},{"$f":"+'5) INPUT COSTI FISSI'!AH14","v":30},{"$f":"+'5) INPUT COSTI FISSI'!AI14","v":30},{"$f":"+'5) INPUT COSTI FISSI'!AJ14","v":30},{"$f":"+'5) INPUT COSTI FISSI'!AK14","v":30},{"$f":"+'5) INPUT COSTI FISSI'!AL14","v":30},{"$f":"+'5) INPUT COSTI FISSI'!AM14","v":30},{"$f":"+'5) INPUT COSTI FISSI'!AN14","v":30},{"$f":"+'5) INPUT COSTI FISSI'!AO14","v":30},{"$f":"+'5) INPUT COSTI FISSI'!AP14","v":360}]
[{"$f":"+'5) INPUT COSTI FISSI'!A15","v":"Acqua"},{"$f":"+'5) INPUT COSTI FISSI'!B15","v":0},{"$f":"+'5) INPUT COSTI FISSI'!C15","v":60},{"$f":"+'5) INPUT COSTI FISSI'!D15","v":0},{"$f":"+'5) INPUT COSTI FISSI'!E15","v":60},{"$f":"+'5) INPUT COSTI FISSI'!F15","v":0},{"$f":"+'5) INPUT COSTI FISSI'!G15","v":60},{"$f":"+'5) INPUT COSTI FISSI'!H15","v":0},{"$f":"+'5) INPUT COSTI FISSI'!I15","v":60},{"$f":"+'5) INPUT COSTI FISSI'!J15","v":0},{"$f":"+'5) INPUT COSTI FISSI'!K15","v":60},{"$f":"+'5) INPUT COSTI FISSI'!L15","v":0},{"$f":"+'5) INPUT COSTI FISSI'!M15","v":60},{"$f":"+'5) INPUT COSTI FISSI'!N15","v":360},null,{"$f":"+'5) INPUT COSTI FISSI'!P15","v":0},{"$f":"+'5) INPUT COSTI FISSI'!Q15","v":60},{"$f":"+'5) INPUT COSTI FISSI'!R15","v":0},{"$f":"+'5) INPUT COSTI FISSI'!S15","v":60},{"$f":"+'5) INPUT COSTI FISSI'!T15","v":0},{"$f":"+'5) INPUT COSTI FISSI'!U15","v":60},{"$f":"+'5) INPUT COSTI FISSI'!V15","v":0},{"$f":"+'5) INPUT COSTI FISSI'!W15","v":60},{"$f":"+'5) INPUT COSTI FISSI'!X15","v":0},{"$f":"+'5) INPUT COSTI FISSI'!Y15","v":60},{"$f":"+'5) INPUT COSTI FISSI'!Z15","v":0},{"$f":"+'5) INPUT COSTI FISSI'!AA15","v":60},{"$f":"+'5) INPUT COSTI FISSI'!AB15","v":360},null,{"$f":"+'5) INPUT COSTI FISSI'!AD15","v":0},{"$f":"+'5) INPUT COSTI FISSI'!AE15","v":60},{"$f":"+'5) INPUT COSTI FISSI'!AF15","v":0},{"$f":"+'5) INPUT COSTI FISSI'!AG15","v":60},{"$f":"+'5) INPUT COSTI FISSI'!AH15","v":0},{"$f":"+'5) INPUT COSTI FISSI'!AI15","v":60},{"$f":"+'5) INPUT COSTI FISSI'!AJ15","v":0},{"$f":"+'5) INPUT COSTI FISSI'!AK15","v":60},{"$f":"+'5) INPUT COSTI FISSI'!AL15","v":0},{"$f":"+'5) INPUT COSTI FISSI'!AM15","v":60},{"$f":"+'5) INPUT COSTI FISSI'!AN15","v":0},{"$f":"+'5) INPUT COSTI FISSI'!AO15","v":60},{"$f":"+'5) INPUT COSTI FISSI'!AP15","v":360}]
[{"$f":"+'5) INPUT COSTI FISSI'!A16","v":"Metano/gas"},{"$f":"+'5) INPUT COSTI FISSI'!B16","v":0},{"$f":"+'5) INPUT COSTI FISSI'!C16","v":0},{"$f":"+'5) INPUT COSTI FISSI'!D16","v":0},{"$f":"+'5) INPUT COSTI FISSI'!E16","v":0},{"$f":"+'5) INPUT COSTI FISSI'!F16","v":0},{"$f":"+'5) INPUT COSTI FISSI'!G16","v":0},{"$f":"+'5) INPUT COSTI FISSI'!H16","v":0},{"$f":"+'5) INPUT COSTI FISSI'!I16","v":0},{"$f":"+'5) INPUT COSTI FISSI'!J16","v":0},{"$f":"+'5) INPUT COSTI FISSI'!K16","v":0},{"$f":"+'5) INPUT COSTI FISSI'!L16","v":0},{"$f":"+'5) INPUT COSTI FISSI'!M16","v":0},{"$f":"+'5) INPUT COSTI FISSI'!N16","v":0},null,{"$f":"+'5) INPUT COSTI FISSI'!P16","v":0},{"$f":"+'5) INPUT COSTI FISSI'!Q16","v":0},{"$f":"+'5) INPUT COSTI FISSI'!R16","v":0},{"$f":"+'5) INPUT COSTI FISSI'!S16","v":0},{"$f":"+'5) INPUT COSTI FISSI'!T16","v":0},{"$f":"+'5) INPUT COSTI FISSI'!U16","v":0},{"$f":"+'5) INPUT COSTI FISSI'!V16","v":0},{"$f":"+'5) INPUT COSTI FISSI'!W16","v":0},{"$f":"+'5) INPUT COSTI FISSI'!X16","v":0},{"$f":"+'5) INPUT COSTI FISSI'!Y16","v":0},{"$f":"+'5) INPUT COSTI FISSI'!Z16","v":0},{"$f":"+'5) INPUT COSTI FISSI'!AA16","v":0},{"$f":"+'5) INPUT COSTI FISSI'!AB16","v":0},null,{"$f":"+'5) INPUT COSTI FISSI'!AD16","v":0},{"$f":"+'5) INPUT COSTI FISSI'!AE16","v":0},{"$f":"+'5) INPUT COSTI FISSI'!AF16","v":0},{"$f":"+'5) INPUT COSTI FISSI'!AG16","v":0},{"$f":"+'5) INPUT COSTI FISSI'!AH16","v":0},{"$f":"+'5) INPUT COSTI FISSI'!AI16","v":0},{"$f":"+'5) INPUT COSTI FISSI'!AJ16","v":0},{"$f":"+'5) INPUT COSTI FISSI'!AK16","v":0},{"$f":"+'5) INPUT COSTI FISSI'!AL16","v":0},{"$f":"+'5) INPUT COSTI FISSI'!AM16","v":0},{"$f":"+'5) INPUT COSTI FISSI'!AN16","v":0},{"$f":"+'5) INPUT COSTI FISSI'!AO16","v":0},{"$f":"+'5) INPUT COSTI FISSI'!AP16","v":0}]
[{"$f":"+'5) INPUT COSTI FISSI'!A17","v":"Condominio"},{"$f":"+'5) INPUT COSTI FISSI'!B17","v":0},{"$f":"+'5) INPUT COSTI FISSI'!C17","v":0},{"$f":"+'5) INPUT COSTI FISSI'!D17","v":0},{"$f":"+'5) INPUT COSTI FISSI'!E17","v":0},{"$f":"+'5) INPUT COSTI FISSI'!F17","v":0},{"$f":"+'5) INPUT COSTI FISSI'!G17","v":0},{"$f":"+'5) INPUT COSTI FISSI'!H17","v":0},{"$f":"+'5) INPUT COSTI FISSI'!I17","v":0},{"$f":"+'5) INPUT COSTI FISSI'!J17","v":0},{"$f":"+'5) INPUT COSTI FISSI'!K17","v":0},{"$f":"+'5) INPUT COSTI FISSI'!L17","v":0},{"$f":"+'5) INPUT COSTI FISSI'!M17","v":0},{"$f":"+'5) INPUT COSTI FISSI'!N17","v":0},null,{"$f":"+'5) INPUT COSTI FISSI'!P17","v":0},{"$f":"+'5) INPUT COSTI FISSI'!Q17","v":0},{"$f":"+'5) INPUT COSTI FISSI'!R17","v":0},{"$f":"+'5) INPUT COSTI FISSI'!S17","v":0},{"$f":"+'5) INPUT COSTI FISSI'!T17","v":0},{"$f":"+'5) INPUT COSTI FISSI'!U17","v":0},{"$f":"+'5) INPUT COSTI FISSI'!V17","v":0},{"$f":"+'5) INPUT COSTI FISSI'!W17","v":0},{"$f":"+'5) INPUT COSTI FISSI'!X17","v":0},{"$f":"+'5) INPUT COSTI FISSI'!Y17","v":0},{"$f":"+'5) INPUT COSTI FISSI'!Z17","v":0},{"$f":"+'5) INPUT COSTI FISSI'!AA17","v":0},{"$f":"+'5) INPUT COSTI FISSI'!AB17","v":0},null,{"$f":"+'5) INPUT COSTI FISSI'!AD17","v":0},{"$f":"+'5) INPUT COSTI FISSI'!AE17","v":0},{"$f":"+'5) INPUT COSTI FISSI'!AF17","v":0},{"$f":"+'5) INPUT COSTI FISSI'!AG17","v":0},{"$f":"+'5) INPUT COSTI FISSI'!AH17","v":0},{"$f":"+'5) INPUT COSTI FISSI'!AI17","v":0},{"$f":"+'5) INPUT COSTI FISSI'!AJ17","v":0},{"$f":"+'5) INPUT COSTI FISSI'!AK17","v":0},{"$f":"+'5) INPUT COSTI FISSI'!AL17","v":0},{"$f":"+'5) INPUT COSTI FISSI'!AM17","v":0},{"$f":"+'5) INPUT COSTI FISSI'!AN17","v":0},{"$f":"+'5) INPUT COSTI FISSI'!AO17","v":0},{"$f":"+'5) INPUT COSTI FISSI'!AP17","v":0}]
[{"$f":"+'5) INPUT COSTI FISSI'!A18","v":"Marche da bollo"},{"$f":"+'5) INPUT COSTI FISSI'!B18","v":0},{"$f":"+'5) INPUT COSTI FISSI'!C18","v":0},{"$f":"+'5) INPUT COSTI FISSI'!D18","v":0},{"$f":"+'5) INPUT COSTI FISSI'!E18","v":0},{"$f":"+'5) INPUT COSTI FISSI'!F18","v":0},{"$f":"+'5) INPUT COSTI FISSI'!G18","v":0},{"$f":"+'5) INPUT COSTI FISSI'!H18","v":0},{"$f":"+'5) INPUT COSTI FISSI'!I18","v":0},{"$f":"+'5) INPUT COSTI FISSI'!J18","v":0},{"$f":"+'5) INPUT COSTI FISSI'!K18","v":0},{"$f":"+'5) INPUT COSTI FISSI'!L18","v":0},{"$f":"+'5) INPUT COSTI FISSI'!M18","v":0},{"$f":"+'5) INPUT COSTI FISSI'!N18","v":0},null,{"$f":"+'5) INPUT COSTI FISSI'!P18","v":0},{"$f":"+'5) INPUT COSTI FISSI'!Q18","v":0},{"$f":"+'5) INPUT COSTI FISSI'!R18","v":0},{"$f":"+'5) INPUT COSTI FISSI'!S18","v":0},{"$f":"+'5) INPUT COSTI FISSI'!T18","v":0},{"$f":"+'5) INPUT COSTI FISSI'!U18","v":0},{"$f":"+'5) INPUT COSTI FISSI'!V18","v":0},{"$f":"+'5) INPUT COSTI FISSI'!W18","v":0},{"$f":"+'5) INPUT COSTI FISSI'!X18","v":0},{"$f":"+'5) INPUT COSTI FISSI'!Y18","v":0},{"$f":"+'5) INPUT COSTI FISSI'!Z18","v":0},{"$f":"+'5) INPUT COSTI FISSI'!AA18","v":0},{"$f":"+'5) INPUT COSTI FISSI'!AB18","v":0},null,{"$f":"+'5) INPUT COSTI FISSI'!AD18","v":0},{"$f":"+'5) INPUT COSTI FISSI'!AE18","v":0},{"$f":"+'5) INPUT COSTI FISSI'!AF18","v":0},{"$f":"+'5) INPUT COSTI FISSI'!AG18","v":0},{"$f":"+'5) INPUT COSTI FISSI'!AH18","v":0},{"$f":"+'5) INPUT COSTI FISSI'!AI18","v":0},{"$f":"+'5) INPUT COSTI FISSI'!AJ18","v":0},{"$f":"+'5) INPUT COSTI FISSI'!AK18","v":0},{"$f":"+'5) INPUT COSTI FISSI'!AL18","v":0},{"$f":"+'5) INPUT COSTI FISSI'!AM18","v":0},{"$f":"+'5) INPUT COSTI FISSI'!AN18","v":0},{"$f":"+'5) INPUT COSTI FISSI'!AO18","v":0},{"$f":"+'5) INPUT COSTI FISSI'!AP18","v":0}]
[{"$f":"+'5) INPUT COSTI FISSI'!A19","v":"Assicurazioni"},{"$f":"+'5) INPUT COSTI FISSI'!B19","v":150},{"$f":"+'5) INPUT COSTI FISSI'!C19","v":0},{"$f":"+'5) INPUT COSTI FISSI'!D19","v":0},{"$f":"+'5) INPUT COSTI FISSI'!E19","v":0},{"$f":"+'5) INPUT COSTI FISSI'!F19","v":0},{"$f":"+'5) INPUT COSTI FISSI'!G19","v":0},{"$f":"+'5) INPUT COSTI FISSI'!H19","v":0},{"$f":"+'5) INPUT COSTI FISSI'!I19","v":0},{"$f":"+'5) INPUT COSTI FISSI'!J19","v":0},{"$f":"+'5) INPUT COSTI FISSI'!K19","v":0},{"$f":"+'5) INPUT COSTI FISSI'!L19","v":0},{"$f":"+'5) INPUT COSTI FISSI'!M19","v":0},{"$f":"+'5) INPUT COSTI FISSI'!N19","v":150},null,{"$f":"+'5) INPUT COSTI FISSI'!P19","v":150},{"$f":"+'5) INPUT COSTI FISSI'!Q19","v":0},{"$f":"+'5) INPUT COSTI FISSI'!R19","v":0},{"$f":"+'5) INPUT COSTI FISSI'!S19","v":0},{"$f":"+'5) INPUT COSTI FISSI'!T19","v":0},{"$f":"+'5) INPUT COSTI FISSI'!U19","v":0},{"$f":"+'5) INPUT COSTI FISSI'!V19","v":0},{"$f":"+'5) INPUT COSTI FISSI'!W19","v":0},{"$f":"+'5) INPUT COSTI FISSI'!X19","v":0},{"$f":"+'5) INPUT COSTI FISSI'!Y19","v":0},{"$f":"+'5) INPUT COSTI FISSI'!Z19","v":0},{"$f":"+'5) INPUT COSTI FISSI'!AA19","v":0},{"$f":"+'5) INPUT COSTI FISSI'!AB19","v":150},null,{"$f":"+'5) INPUT COSTI FISSI'!AD19","v":150},{"$f":"+'5) INPUT COSTI FISSI'!AE19","v":0},{"$f":"+'5) INPUT COSTI FISSI'!AF19","v":0},{"$f":"+'5) INPUT COSTI FISSI'!AG19","v":0},{"$f":"+'5) INPUT COSTI FISSI'!AH19","v":0},{"$f":"+'5) INPUT COSTI FISSI'!AI19","v":0},{"$f":"+'5) INPUT COSTI FISSI'!AJ19","v":0},{"$f":"+'5) INPUT COSTI FISSI'!AK19","v":0},{"$f":"+'5) INPUT COSTI FISSI'!AL19","v":0},{"$f":"+'5) INPUT COSTI FISSI'!AM19","v":0},{"$f":"+'5) INPUT COSTI FISSI'!AN19","v":0},{"$f":"+'5) INPUT COSTI FISSI'!AO19","v":0},{"$f":"+'5) INPUT COSTI FISSI'!AP19","v":150}]
[{"$f":"+'5) INPUT COSTI FISSI'!A20","v":"Prodotti per la pulizia dei locali"},{"$f":"+'5) INPUT COSTI FISSI'!B20","v":50},{"$f":"+'5) INPUT COSTI FISSI'!C20","v":0},{"$f":"+'5) INPUT COSTI FISSI'!D20","v":0},{"$f":"+'5) INPUT COSTI FISSI'!E20","v":50},{"$f":"+'5) INPUT COSTI FISSI'!F20","v":0},{"$f":"+'5) INPUT COSTI FISSI'!G20","v":0},{"$f":"+'5) INPUT COSTI FISSI'!H20","v":50},{"$f":"+'5) INPUT COSTI FISSI'!I20","v":0},{"$f":"+'5) INPUT COSTI FISSI'!J20","v":0},{"$f":"+'5) INPUT COSTI FISSI'!K20","v":50},{"$f":"+'5) INPUT COSTI FISSI'!L20","v":0},{"$f":"+'5) INPUT COSTI FISSI'!M20","v":0},{"$f":"+'5) INPUT COSTI FISSI'!N20","v":200},null,{"$f":"+'5) INPUT COSTI FISSI'!P20","v":50},{"$f":"+'5) INPUT COSTI FISSI'!Q20","v":0},{"$f":"+'5) INPUT COSTI FISSI'!R20","v":0},{"$f":"+'5) INPUT COSTI FISSI'!S20","v":50},{"$f":"+'5) INPUT COSTI FISSI'!T20","v":0},{"$f":"+'5) INPUT COSTI FISSI'!U20","v":0},{"$f":"+'5) INPUT COSTI FISSI'!V20","v":50},{"$f":"+'5) INPUT COSTI FISSI'!W20","v":0},{"$f":"+'5) INPUT COSTI FISSI'!X20","v":0},{"$f":"+'5) INPUT COSTI FISSI'!Y20","v":50},{"$f":"+'5) INPUT COSTI FISSI'!Z20","v":0},{"$f":"+'5) INPUT COSTI FISSI'!AA20","v":0},{"$f":"+'5) INPUT COSTI FISSI'!AB20","v":200},null,{"$f":"+'5) INPUT COSTI FISSI'!AD20","v":50},{"$f":"+'5) INPUT COSTI FISSI'!AE20","v":0},{"$f":"+'5) INPUT COSTI FISSI'!AF20","v":0},{"$f":"+'5) INPUT COSTI FISSI'!AG20","v":50},{"$f":"+'5) INPUT COSTI FISSI'!AH20","v":0},{"$f":"+'5) INPUT COSTI FISSI'!AI20","v":0},{"$f":"+'5) INPUT COSTI FISSI'!AJ20","v":50},{"$f":"+'5) INPUT COSTI FISSI'!AK20","v":0},{"$f":"+'5) INPUT COSTI FISSI'!AL20","v":0},{"$f":"+'5) INPUT COSTI FISSI'!AM20","v":50},{"$f":"+'5) INPUT COSTI FISSI'!AN20","v":0},{"$f":"+'5) INPUT COSTI FISSI'!AO20","v":0},{"$f":"+'5) INPUT COSTI FISSI'!AP20","v":200}]
[{"$f":"+'5) INPUT COSTI FISSI'!A21","v":"Pulizia"},{"$f":"+'5) INPUT COSTI FISSI'!B21","v":0},{"$f":"+'5) INPUT COSTI FISSI'!C21","v":0},{"$f":"+'5) INPUT COSTI FISSI'!D21","v":0},{"$f":"+'5) INPUT COSTI FISSI'!E21","v":0},{"$f":"+'5) INPUT COSTI FISSI'!F21","v":0},{"$f":"+'5) INPUT COSTI FISSI'!G21","v":0},{"$f":"+'5) INPUT COSTI FISSI'!H21","v":0},{"$f":"+'5) INPUT COSTI FISSI'!I21","v":0},{"$f":"+'5) INPUT COSTI FISSI'!J21","v":0},{"$f":"+'5) INPUT COSTI FISSI'!K21","v":0},{"$f":"+'5) INPUT COSTI FISSI'!L21","v":0},{"$f":"+'5) INPUT COSTI FISSI'!M21","v":0},{"$f":"+'5) INPUT COSTI FISSI'!N21","v":0},null,{"$f":"+'5) INPUT COSTI FISSI'!P21","v":0},{"$f":"+'5) INPUT COSTI FISSI'!Q21","v":0},{"$f":"+'5) INPUT COSTI FISSI'!R21","v":0},{"$f":"+'5) INPUT COSTI FISSI'!S21","v":0},{"$f":"+'5) INPUT COSTI FISSI'!T21","v":0},{"$f":"+'5) INPUT COSTI FISSI'!U21","v":0},{"$f":"+'5) INPUT COSTI FISSI'!V21","v":0},{"$f":"+'5) INPUT COSTI FISSI'!W21","v":0},{"$f":"+'5) INPUT COSTI FISSI'!X21","v":0},{"$f":"+'5) INPUT COSTI FISSI'!Y21","v":0},{"$f":"+'5) INPUT COSTI FISSI'!Z21","v":0},{"$f":"+'5) INPUT COSTI FISSI'!AA21","v":0},{"$f":"+'5) INPUT COSTI FISSI'!AB21","v":0},null,{"$f":"+'5) INPUT COSTI FISSI'!AD21","v":0},{"$f":"+'5) INPUT COSTI FISSI'!AE21","v":0},{"$f":"+'5) INPUT COSTI FISSI'!AF21","v":0},{"$f":"+'5) INPUT COSTI FISSI'!AG21","v":0},{"$f":"+'5) INPUT COSTI FISSI'!AH21","v":0},{"$f":"+'5) INPUT COSTI FISSI'!AI21","v":0},{"$f":"+'5) INPUT COSTI FISSI'!AJ21","v":0},{"$f":"+'5) INPUT COSTI FISSI'!AK21","v":0},{"$f":"+'5) INPUT COSTI FISSI'!AL21","v":0},{"$f":"+'5) INPUT COSTI FISSI'!AM21","v":0},{"$f":"+'5) INPUT COSTI FISSI'!AN21","v":0},{"$f":"+'5) INPUT COSTI FISSI'!AO21","v":0},{"$f":"+'5) INPUT COSTI FISSI'!AP21","v":0}]
[{"$f":"+'5) INPUT COSTI FISSI'!A22","v":"Guardianaggio"},{"$f":"+'5) INPUT COSTI FISSI'!B22","v":0},{"$f":"+'5) INPUT COSTI FISSI'!C22","v":0},{"$f":"+'5) INPUT COSTI FISSI'!D22","v":0},{"$f":"+'5) INPUT COSTI FISSI'!E22","v":0},{"$f":"+'5) INPUT COSTI FISSI'!F22","v":0},{"$f":"+'5) INPUT COSTI FISSI'!G22","v":0},{"$f":"+'5) INPUT COSTI FISSI'!H22","v":0},{"$f":"+'5) INPUT COSTI FISSI'!I22","v":0},{"$f":"+'5) INPUT COSTI FISSI'!J22","v":0},{"$f":"+'5) INPUT COSTI FISSI'!K22","v":0},{"$f":"+'5) INPUT COSTI FISSI'!L22","v":0},{"$f":"+'5) INPUT COSTI FISSI'!M22","v":0},{"$f":"+'5) INPUT COSTI FISSI'!N22","v":0},null,{"$f":"+'5) INPUT COSTI FISSI'!P22","v":0},{"$f":"+'5) INPUT COSTI FISSI'!Q22","v":0},{"$f":"+'5) INPUT COSTI FISSI'!R22","v":0},{"$f":"+'5) INPUT COSTI FISSI'!S22","v":0},{"$f":"+'5) INPUT COSTI FISSI'!T22","v":0},{"$f":"+'5) INPUT COSTI FISSI'!U22","v":0},{"$f":"+'5) INPUT COSTI FISSI'!V22","v":0},{"$f":"+'5) INPUT COSTI FISSI'!W22","v":0},{"$f":"+'5) INPUT COSTI FISSI'!X22","v":0},{"$f":"+'5) INPUT COSTI FISSI'!Y22","v":0},{"$f":"+'5) INPUT COSTI FISSI'!Z22","v":0},{"$f":"+'5) INPUT COSTI FISSI'!AA22","v":0},{"$f":"+'5) INPUT COSTI FISSI'!AB22","v":0},null,{"$f":"+'5) INPUT COSTI FISSI'!AD22","v":0},{"$f":"+'5) INPUT COSTI FISSI'!AE22","v":0},{"$f":"+'5) INPUT COSTI FISSI'!AF22","v":0},{"$f":"+'5) INPUT COSTI FISSI'!AG22","v":0},{"$f":"+'5) INPUT COSTI FISSI'!AH22","v":0},{"$f":"+'5) INPUT COSTI FISSI'!AI22","v":0},{"$f":"+'5) INPUT COSTI FISSI'!AJ22","v":0},{"$f":"+'5) INPUT COSTI FISSI'!AK22","v":0},{"$f":"+'5) INPUT COSTI FISSI'!AL22","v":0},{"$f":"+'5) INPUT COSTI FISSI'!AM22","v":0},{"$f":"+'5) INPUT COSTI FISSI'!AN22","v":0},{"$f":"+'5) INPUT COSTI FISSI'!AO22","v":0},{"$f":"+'5) INPUT COSTI FISSI'!AP22","v":0}]
[{"$f":"+'5) INPUT COSTI FISSI'!A23","v":"Cancelleria"},{"$f":"+'5) INPUT COSTI FISSI'!B23","v":100},{"$f":"+'5) INPUT COSTI FISSI'!C23","v":0},{"$f":"+'5) INPUT COSTI FISSI'!D23","v":0},{"$f":"+'5) INPUT COSTI FISSI'!E23","v":0},{"$f":"+'5) INPUT COSTI FISSI'!F23","v":0},{"$f":"+'5) INPUT COSTI FISSI'!G23","v":0},{"$f":"+'5) INPUT COSTI FISSI'!H23","v":0},{"$f":"+'5) INPUT COSTI FISSI'!I23","v":0},{"$f":"+'5) INPUT COSTI FISSI'!J23","v":0},{"$f":"+'5) INPUT COSTI FISSI'!K23","v":0},{"$f":"+'5) INPUT COSTI FISSI'!L23","v":0},{"$f":"+'5) INPUT COSTI FISSI'!M23","v":0},{"$f":"+'5) INPUT COSTI FISSI'!N23","v":100},null,{"$f":"+'5) INPUT COSTI FISSI'!P23","v":100},{"$f":"+'5) INPUT COSTI FISSI'!Q23","v":0},{"$f":"+'5) INPUT COSTI FISSI'!R23","v":0},{"$f":"+'5) INPUT COSTI FISSI'!S23","v":0},{"$f":"+'5) INPUT COSTI FISSI'!T23","v":0},{"$f":"+'5) INPUT COSTI FISSI'!U23","v":0},{"$f":"+'5) INPUT COSTI FISSI'!V23","v":0},{"$f":"+'5) INPUT COSTI FISSI'!W23","v":0},{"$f":"+'5) INPUT COSTI FISSI'!X23","v":0},{"$f":"+'5) INPUT COSTI FISSI'!Y23","v":0},{"$f":"+'5) INPUT COSTI FISSI'!Z23","v":0},{"$f":"+'5) INPUT COSTI FISSI'!AA23","v":0},{"$f":"+'5) INPUT COSTI FISSI'!AB23","v":100},null,{"$f":"+'5) INPUT COSTI FISSI'!AD23","v":100},{"$f":"+'5) INPUT COSTI FISSI'!AE23","v":0},{"$f":"+'5) INPUT COSTI FISSI'!AF23","v":0},{"$f":"+'5) INPUT COSTI FISSI'!AG23","v":0},{"$f":"+'5) INPUT COSTI FISSI'!AH23","v":0},{"$f":"+'5) INPUT COSTI FISSI'!AI23","v":0},{"$f":"+'5) INPUT COSTI FISSI'!AJ23","v":0},{"$f":"+'5) INPUT COSTI FISSI'!AK23","v":0},{"$f":"+'5) INPUT COSTI FISSI'!AL23","v":0},{"$f":"+'5) INPUT COSTI FISSI'!AM23","v":0},{"$f":"+'5) INPUT COSTI FISSI'!AN23","v":0},{"$f":"+'5) INPUT COSTI FISSI'!AO23","v":0},{"$f":"+'5) INPUT COSTI FISSI'!AP23","v":100}]
[{"$f":"+'5) INPUT COSTI FISSI'!A24","v":"Imposta sui rifiuti"},{"$f":"+'5) INPUT COSTI FISSI'!B24","v":0},{"$f":"+'5) INPUT COSTI FISSI'!C24","v":0},{"$f":"+'5) INPUT COSTI FISSI'!D24","v":0},{"$f":"+'5) INPUT COSTI FISSI'!E24","v":0},{"$f":"+'5) INPUT COSTI FISSI'!F24","v":0},{"$f":"+'5) INPUT COSTI FISSI'!G24","v":0},{"$f":"+'5) INPUT COSTI FISSI'!H24","v":0},{"$f":"+'5) INPUT COSTI FISSI'!I24","v":0},{"$f":"+'5) INPUT COSTI FISSI'!J24","v":0},{"$f":"+'5) INPUT COSTI FISSI'!K24","v":0},{"$f":"+'5) INPUT COSTI FISSI'!L24","v":0},{"$f":"+'5) INPUT COSTI FISSI'!M24","v":0},{"$f":"+'5) INPUT COSTI FISSI'!N24","v":0},null,{"$f":"+'5) INPUT COSTI FISSI'!P24","v":0},{"$f":"+'5) INPUT COSTI FISSI'!Q24","v":0},{"$f":"+'5) INPUT COSTI FISSI'!R24","v":0},{"$f":"+'5) INPUT COSTI FISSI'!S24","v":0},{"$f":"+'5) INPUT COSTI FISSI'!T24","v":0},{"$f":"+'5) INPUT COSTI FISSI'!U24","v":0},{"$f":"+'5) INPUT COSTI FISSI'!V24","v":0},{"$f":"+'5) INPUT COSTI FISSI'!W24","v":0},{"$f":"+'5) INPUT COSTI FISSI'!X24","v":0},{"$f":"+'5) INPUT COSTI FISSI'!Y24","v":0},{"$f":"+'5) INPUT COSTI FISSI'!Z24","v":0},{"$f":"+'5) INPUT COSTI FISSI'!AA24","v":0},{"$f":"+'5) INPUT COSTI FISSI'!AB24","v":0},null,{"$f":"+'5) INPUT COSTI FISSI'!AD24","v":0},{"$f":"+'5) INPUT COSTI FISSI'!AE24","v":0},{"$f":"+'5) INPUT COSTI FISSI'!AF24","v":0},{"$f":"+'5) INPUT COSTI FISSI'!AG24","v":0},{"$f":"+'5) INPUT COSTI FISSI'!AH24","v":0},{"$f":"+'5) INPUT COSTI FISSI'!AI24","v":0},{"$f":"+'5) INPUT COSTI FISSI'!AJ24","v":0},{"$f":"+'5) INPUT COSTI FISSI'!AK24","v":0},{"$f":"+'5) INPUT COSTI FISSI'!AL24","v":0},{"$f":"+'5) INPUT COSTI FISSI'!AM24","v":0},{"$f":"+'5) INPUT COSTI FISSI'!AN24","v":0},{"$f":"+'5) INPUT COSTI FISSI'!AO24","v":0},{"$f":"+'5) INPUT COSTI FISSI'!AP24","v":0}]
[{"$f":"+'5) INPUT COSTI FISSI'!A25","v":"Imu"},{"$f":"+'5) INPUT COSTI FISSI'!B25","v":0},{"$f":"+'5) INPUT COSTI FISSI'!C25","v":0},{"$f":"+'5) INPUT COSTI FISSI'!D25","v":0},{"$f":"+'5) INPUT COSTI FISSI'!E25","v":0},{"$f":"+'5) INPUT COSTI FISSI'!F25","v":0},{"$f":"+'5) INPUT COSTI FISSI'!G25","v":0},{"$f":"+'5) INPUT COSTI FISSI'!H25","v":0},{"$f":"+'5) INPUT COSTI FISSI'!I25","v":0},{"$f":"+'5) INPUT COSTI FISSI'!J25","v":0},{"$f":"+'5) INPUT COSTI FISSI'!K25","v":0},{"$f":"+'5) INPUT COSTI FISSI'!L25","v":0},{"$f":"+'5) INPUT COSTI FISSI'!M25","v":0},{"$f":"+'5) INPUT COSTI FISSI'!N25","v":0},null,{"$f":"+'5) INPUT COSTI FISSI'!P25","v":0},{"$f":"+'5) INPUT COSTI FISSI'!Q25","v":0},{"$f":"+'5) INPUT COSTI FISSI'!R25","v":0},{"$f":"+'5) INPUT COSTI FISSI'!S25","v":0},{"$f":"+'5) INPUT COSTI FISSI'!T25","v":0},{"$f":"+'5) INPUT COSTI FISSI'!U25","v":0},{"$f":"+'5) INPUT COSTI FISSI'!V25","v":0},{"$f":"+'5) INPUT COSTI FISSI'!W25","v":0},{"$f":"+'5) INPUT COSTI FISSI'!X25","v":0},{"$f":"+'5) INPUT COSTI FISSI'!Y25","v":0},{"$f":"+'5) INPUT COSTI FISSI'!Z25","v":0},{"$f":"+'5) INPUT COSTI FISSI'!AA25","v":0},{"$f":"+'5) INPUT COSTI FISSI'!AB25","v":0},null,{"$f":"+'5) INPUT COSTI FISSI'!AD25","v":0},{"$f":"+'5) INPUT COSTI FISSI'!AE25","v":0},{"$f":"+'5) INPUT COSTI FISSI'!AF25","v":0},{"$f":"+'5) INPUT COSTI FISSI'!AG25","v":0},{"$f":"+'5) INPUT COSTI FISSI'!AH25","v":0},{"$f":"+'5) INPUT COSTI FISSI'!AI25","v":0},{"$f":"+'5) INPUT COSTI FISSI'!AJ25","v":0},{"$f":"+'5) INPUT COSTI FISSI'!AK25","v":0},{"$f":"+'5) INPUT COSTI FISSI'!AL25","v":0},{"$f":"+'5) INPUT COSTI FISSI'!AM25","v":0},{"$f":"+'5) INPUT COSTI FISSI'!AN25","v":0},{"$f":"+'5) INPUT COSTI FISSI'!AO25","v":0},{"$f":"+'5) INPUT COSTI FISSI'!AP25","v":0}]
[{"$f":"+'5) INPUT COSTI FISSI'!A26","v":"Tasi"},{"$f":"+'5) INPUT COSTI FISSI'!B26","v":0},{"$f":"+'5) INPUT COSTI FISSI'!C26","v":0},{"$f":"+'5) INPUT COSTI FISSI'!D26","v":0},{"$f":"+'5) INPUT COSTI FISSI'!E26","v":0},{"$f":"+'5) INPUT COSTI FISSI'!F26","v":0},{"$f":"+'5) INPUT COSTI FISSI'!G26","v":0},{"$f":"+'5) INPUT COSTI FISSI'!H26","v":0},{"$f":"+'5) INPUT COSTI FISSI'!I26","v":0},{"$f":"+'5) INPUT COSTI FISSI'!J26","v":0},{"$f":"+'5) INPUT COSTI FISSI'!K26","v":0},{"$f":"+'5) INPUT COSTI FISSI'!L26","v":0},{"$f":"+'5) INPUT COSTI FISSI'!M26","v":0},{"$f":"+'5) INPUT COSTI FISSI'!N26","v":0},null,{"$f":"+'5) INPUT COSTI FISSI'!P26","v":0},{"$f":"+'5) INPUT COSTI FISSI'!Q26","v":0},{"$f":"+'5) INPUT COSTI FISSI'!R26","v":0},{"$f":"+'5) INPUT COSTI FISSI'!S26","v":0},{"$f":"+'5) INPUT COSTI FISSI'!T26","v":0},{"$f":"+'5) INPUT COSTI FISSI'!U26","v":0},{"$f":"+'5) INPUT COSTI FISSI'!V26","v":0},{"$f":"+'5) INPUT COSTI FISSI'!W26","v":0},{"$f":"+'5) INPUT COSTI FISSI'!X26","v":0},{"$f":"+'5) INPUT COSTI FISSI'!Y26","v":0},{"$f":"+'5) INPUT COSTI FISSI'!Z26","v":0},{"$f":"+'5) INPUT COSTI FISSI'!AA26","v":0},{"$f":"+'5) INPUT COSTI FISSI'!AB26","v":0},null,{"$f":"+'5) INPUT COSTI FISSI'!AD26","v":0},{"$f":"+'5) INPUT COSTI FISSI'!AE26","v":0},{"$f":"+'5) INPUT COSTI FISSI'!AF26","v":0},{"$f":"+'5) INPUT COSTI FISSI'!AG26","v":0},{"$f":"+'5) INPUT COSTI FISSI'!AH26","v":0},{"$f":"+'5) INPUT COSTI FISSI'!AI26","v":0},{"$f":"+'5) INPUT COSTI FISSI'!AJ26","v":0},{"$f":"+'5) INPUT COSTI FISSI'!AK26","v":0},{"$f":"+'5) INPUT COSTI FISSI'!AL26","v":0},{"$f":"+'5) INPUT COSTI FISSI'!AM26","v":0},{"$f":"+'5) INPUT COSTI FISSI'!AN26","v":0},{"$f":"+'5) INPUT COSTI FISSI'!AO26","v":0},{"$f":"+'5) INPUT COSTI FISSI'!AP26","v":0}]
[{"$f":"+'5) INPUT COSTI FISSI'!A27","v":"Collaborazioni occasionali (stagionali)"},{"$f":"+'5) INPUT COSTI FISSI'!B27","v":0},{"$f":"+'5) INPUT COSTI FISSI'!C27","v":0},{"$f":"+'5) INPUT COSTI FISSI'!D27","v":0},{"$f":"+'5) INPUT COSTI FISSI'!E27","v":0},{"$f":"+'5) INPUT COSTI FISSI'!F27","v":0},{"$f":"+'5) INPUT COSTI FISSI'!G27","v":0},{"$f":"+'5) INPUT COSTI FISSI'!H27","v":0},{"$f":"+'5) INPUT COSTI FISSI'!I27","v":0},{"$f":"+'5) INPUT COSTI FISSI'!J27","v":0},{"$f":"+'5) INPUT COSTI FISSI'!K27","v":0},{"$f":"+'5) INPUT COSTI FISSI'!L27","v":0},{"$f":"+'5) INPUT COSTI FISSI'!M27","v":0},{"$f":"+'5) INPUT COSTI FISSI'!N27","v":0},null,{"$f":"+'5) INPUT COSTI FISSI'!P27","v":0},{"$f":"+'5) INPUT COSTI FISSI'!Q27","v":0},{"$f":"+'5) INPUT COSTI FISSI'!R27","v":0},{"$f":"+'5) INPUT COSTI FISSI'!S27","v":0},{"$f":"+'5) INPUT COSTI FISSI'!T27","v":0},{"$f":"+'5) INPUT COSTI FISSI'!U27","v":0},{"$f":"+'5) INPUT COSTI FISSI'!V27","v":0},{"$f":"+'5) INPUT COSTI FISSI'!W27","v":0},{"$f":"+'5) INPUT COSTI FISSI'!X27","v":0},{"$f":"+'5) INPUT COSTI FISSI'!Y27","v":0},{"$f":"+'5) INPUT COSTI FISSI'!Z27","v":0},{"$f":"+'5) INPUT COSTI FISSI'!AA27","v":0},{"$f":"+'5) INPUT COSTI FISSI'!AB27","v":0},null,{"$f":"+'5) INPUT COSTI FISSI'!AD27","v":0},{"$f":"+'5) INPUT COSTI FISSI'!AE27","v":0},{"$f":"+'5) INPUT COSTI FISSI'!AF27","v":0},{"$f":"+'5) INPUT COSTI FISSI'!AG27","v":0},{"$f":"+'5) INPUT COSTI FISSI'!AH27","v":0},{"$f":"+'5) INPUT COSTI FISSI'!AI27","v":0},{"$f":"+'5) INPUT COSTI FISSI'!AJ27","v":0},{"$f":"+'5) INPUT COSTI FISSI'!AK27","v":0},{"$f":"+'5) INPUT COSTI FISSI'!AL27","v":0},{"$f":"+'5) INPUT COSTI FISSI'!AM27","v":0},{"$f":"+'5) INPUT COSTI FISSI'!AN27","v":0},{"$f":"+'5) INPUT COSTI FISSI'!AO27","v":0},{"$f":"+'5) INPUT COSTI FISSI'!AP27","v":0}]
[{"$f":"+'5) INPUT COSTI FISSI'!A28","v":"Altri costi fissi"},{"$f":"+'5) INPUT COSTI FISSI'!B28","v":0},{"$f":"+'5) INPUT COSTI FISSI'!C28","v":0},{"$f":"+'5) INPUT COSTI FISSI'!D28","v":0},{"$f":"+'5) INPUT COSTI FISSI'!E28","v":0},{"$f":"+'5) INPUT COSTI FISSI'!F28","v":0},{"$f":"+'5) INPUT COSTI FISSI'!G28","v":0},{"$f":"+'5) INPUT COSTI FISSI'!H28","v":0},{"$f":"+'5) INPUT COSTI FISSI'!I28","v":0},{"$f":"+'5) INPUT COSTI FISSI'!J28","v":0},{"$f":"+'5) INPUT COSTI FISSI'!K28","v":0},{"$f":"+'5) INPUT COSTI FISSI'!L28","v":0},{"$f":"+'5) INPUT COSTI FISSI'!M28","v":0},{"$f":"+'5) INPUT COSTI FISSI'!N28","v":0},null,{"$f":"+'5) INPUT COSTI FISSI'!P28","v":0},{"$f":"+'5) INPUT COSTI FISSI'!Q28","v":0},{"$f":"+'5) INPUT COSTI FISSI'!R28","v":0},{"$f":"+'5) INPUT COSTI FISSI'!S28","v":0},{"$f":"+'5) INPUT COSTI FISSI'!T28","v":0},{"$f":"+'5) INPUT COSTI FISSI'!U28","v":0},{"$f":"+'5) INPUT COSTI FISSI'!V28","v":0},{"$f":"+'5) INPUT COSTI FISSI'!W28","v":0},{"$f":"+'5) INPUT COSTI FISSI'!X28","v":0},{"$f":"+'5) INPUT COSTI FISSI'!Y28","v":0},{"$f":"+'5) INPUT COSTI FISSI'!Z28","v":0},{"$f":"+'5) INPUT COSTI FISSI'!AA28","v":0},{"$f":"+'5) INPUT COSTI FISSI'!AB28","v":0},null,{"$f":"+'5) INPUT COSTI FISSI'!AD28","v":0},{"$f":"+'5) INPUT COSTI FISSI'!AE28","v":0},{"$f":"+'5) INPUT COSTI FISSI'!AF28","v":0},{"$f":"+'5) INPUT COSTI FISSI'!AG28","v":0},{"$f":"+'5) INPUT COSTI FISSI'!AH28","v":0},{"$f":"+'5) INPUT COSTI FISSI'!AI28","v":0},{"$f":"+'5) INPUT COSTI FISSI'!AJ28","v":0},{"$f":"+'5) INPUT COSTI FISSI'!AK28","v":0},{"$f":"+'5) INPUT COSTI FISSI'!AL28","v":0},{"$f":"+'5) INPUT COSTI FISSI'!AM28","v":0},{"$f":"+'5) INPUT COSTI FISSI'!AN28","v":0},{"$f":"+'5) INPUT COSTI FISSI'!AO28","v":0},{"$f":"+'5) INPUT COSTI FISSI'!AP28","v":0}]
[{"$f":"+'5) INPUT COSTI FISSI'!A29","v":"Altri costi fissi"},{"$f":"+'5) INPUT COSTI FISSI'!B29","v":0},{"$f":"+'5) INPUT COSTI FISSI'!C29","v":0},{"$f":"+'5) INPUT COSTI FISSI'!D29","v":0},{"$f":"+'5) INPUT COSTI FISSI'!E29","v":0},{"$f":"+'5) INPUT COSTI FISSI'!F29","v":0},{"$f":"+'5) INPUT COSTI FISSI'!G29","v":0},{"$f":"+'5) INPUT COSTI FISSI'!H29","v":0},{"$f":"+'5) INPUT COSTI FISSI'!I29","v":0},{"$f":"+'5) INPUT COSTI FISSI'!J29","v":0},{"$f":"+'5) INPUT COSTI FISSI'!K29","v":0},{"$f":"+'5) INPUT COSTI FISSI'!L29","v":0},{"$f":"+'5) INPUT COSTI FISSI'!M29","v":0},{"$f":"+'5) INPUT COSTI FISSI'!N29","v":0},null,{"$f":"+'5) INPUT COSTI FISSI'!P29","v":0},{"$f":"+'5) INPUT COSTI FISSI'!Q29","v":0},{"$f":"+'5) INPUT COSTI FISSI'!R29","v":0},{"$f":"+'5) INPUT COSTI FISSI'!S29","v":0},{"$f":"+'5) INPUT COSTI FISSI'!T29","v":0},{"$f":"+'5) INPUT COSTI FISSI'!U29","v":0},{"$f":"+'5) INPUT COSTI FISSI'!V29","v":0},{"$f":"+'5) INPUT COSTI FISSI'!W29","v":0},{"$f":"+'5) INPUT COSTI FISSI'!X29","v":0},{"$f":"+'5) INPUT COSTI FISSI'!Y29","v":0},{"$f":"+'5) INPUT COSTI FISSI'!Z29","v":0},{"$f":"+'5) INPUT COSTI FISSI'!AA29","v":0},{"$f":"+'5) INPUT COSTI FISSI'!AB29","v":0},null,{"$f":"+'5) INPUT COSTI FISSI'!AD29","v":0},{"$f":"+'5) INPUT COSTI FISSI'!AE29","v":0},{"$f":"+'5) INPUT COSTI FISSI'!AF29","v":0},{"$f":"+'5) INPUT COSTI FISSI'!AG29","v":0},{"$f":"+'5) INPUT COSTI FISSI'!AH29","v":0},{"$f":"+'5) INPUT COSTI FISSI'!AI29","v":0},{"$f":"+'5) INPUT COSTI FISSI'!AJ29","v":0},{"$f":"+'5) INPUT COSTI FISSI'!AK29","v":0},{"$f":"+'5) INPUT COSTI FISSI'!AL29","v":0},{"$f":"+'5) INPUT COSTI FISSI'!AM29","v":0},{"$f":"+'5) INPUT COSTI FISSI'!AN29","v":0},{"$f":"+'5) INPUT COSTI FISSI'!AO29","v":0},{"$f":"+'5) INPUT COSTI FISSI'!AP29","v":0}]
[{"$f":"+'5) INPUT COSTI FISSI'!A30","v":"Altri costi fissi"},{"$f":"+'5) INPUT COSTI FISSI'!B30","v":0},{"$f":"+'5) INPUT COSTI FISSI'!C30","v":0},{"$f":"+'5) INPUT COSTI FISSI'!D30","v":0},{"$f":"+'5) INPUT COSTI FISSI'!E30","v":0},{"$f":"+'5) INPUT COSTI FISSI'!F30","v":0},{"$f":"+'5) INPUT COSTI FISSI'!G30","v":0},{"$f":"+'5) INPUT COSTI FISSI'!H30","v":0},{"$f":"+'5) INPUT COSTI FISSI'!I30","v":0},{"$f":"+'5) INPUT COSTI FISSI'!J30","v":0},{"$f":"+'5) INPUT COSTI FISSI'!K30","v":0},{"$f":"+'5) INPUT COSTI FISSI'!L30","v":0},{"$f":"+'5) INPUT COSTI FISSI'!M30","v":0},{"$f":"+'5) INPUT COSTI FISSI'!N30","v":0},null,{"$f":"+'5) INPUT COSTI FISSI'!P30","v":0},{"$f":"+'5) INPUT COSTI FISSI'!Q30","v":0},{"$f":"+'5) INPUT COSTI FISSI'!R30","v":0},{"$f":"+'5) INPUT COSTI FISSI'!S30","v":0},{"$f":"+'5) INPUT COSTI FISSI'!T30","v":0},{"$f":"+'5) INPUT COSTI FISSI'!U30","v":0},{"$f":"+'5) INPUT COSTI FISSI'!V30","v":0},{"$f":"+'5) INPUT COSTI FISSI'!W30","v":0},{"$f":"+'5) INPUT COSTI FISSI'!X30","v":0},{"$f":"+'5) INPUT COSTI FISSI'!Y30","v":0},{"$f":"+'5) INPUT COSTI FISSI'!Z30","v":0},{"$f":"+'5) INPUT COSTI FISSI'!AA30","v":0},{"$f":"+'5) INPUT COSTI FISSI'!AB30","v":0},null,{"$f":"+'5) INPUT COSTI FISSI'!AD30","v":0},{"$f":"+'5) INPUT COSTI FISSI'!AE30","v":0},{"$f":"+'5) INPUT COSTI FISSI'!AF30","v":0},{"$f":"+'5) INPUT COSTI FISSI'!AG30","v":0},{"$f":"+'5) INPUT COSTI FISSI'!AH30","v":0},{"$f":"+'5) INPUT COSTI FISSI'!AI30","v":0},{"$f":"+'5) INPUT COSTI FISSI'!AJ30","v":0},{"$f":"+'5) INPUT COSTI FISSI'!AK30","v":0},{"$f":"+'5) INPUT COSTI FISSI'!AL30","v":0},{"$f":"+'5) INPUT COSTI FISSI'!AM30","v":0},{"$f":"+'5) INPUT COSTI FISSI'!AN30","v":0},{"$f":"+'5) INPUT COSTI FISSI'!AO30","v":0},{"$f":"+'5) INPUT COSTI FISSI'!AP30","v":0}]
[{"$f":"+'5) INPUT COSTI FISSI'!A31","v":"Altri costi fissi"},{"$f":"+'5) INPUT COSTI FISSI'!B31","v":0},{"$f":"+'5) INPUT COSTI FISSI'!C31","v":0},{"$f":"+'5) INPUT COSTI FISSI'!D31","v":0},{"$f":"+'5) INPUT COSTI FISSI'!E31","v":0},{"$f":"+'5) INPUT COSTI FISSI'!F31","v":0},{"$f":"+'5) INPUT COSTI FISSI'!G31","v":0},{"$f":"+'5) INPUT COSTI FISSI'!H31","v":0},{"$f":"+'5) INPUT COSTI FISSI'!I31","v":0},{"$f":"+'5) INPUT COSTI FISSI'!J31","v":0},{"$f":"+'5) INPUT COSTI FISSI'!K31","v":0},{"$f":"+'5) INPUT COSTI FISSI'!L31","v":0},{"$f":"+'5) INPUT COSTI FISSI'!M31","v":0},{"$f":"+'5) INPUT COSTI FISSI'!N31","v":0},null,{"$f":"+'5) INPUT COSTI FISSI'!P31","v":0},{"$f":"+'5) INPUT COSTI FISSI'!Q31","v":0},{"$f":"+'5) INPUT COSTI FISSI'!R31","v":0},{"$f":"+'5) INPUT COSTI FISSI'!S31","v":0},{"$f":"+'5) INPUT COSTI FISSI'!T31","v":0},{"$f":"+'5) INPUT COSTI FISSI'!U31","v":0},{"$f":"+'5) INPUT COSTI FISSI'!V31","v":0},{"$f":"+'5) INPUT COSTI FISSI'!W31","v":0},{"$f":"+'5) INPUT COSTI FISSI'!X31","v":0},{"$f":"+'5) INPUT COSTI FISSI'!Y31","v":0},{"$f":"+'5) INPUT COSTI FISSI'!Z31","v":0},{"$f":"+'5) INPUT COSTI FISSI'!AA31","v":0},{"$f":"+'5) INPUT COSTI FISSI'!AB31","v":0},null,{"$f":"+'5) INPUT COSTI FISSI'!AD31","v":0},{"$f":"+'5) INPUT COSTI FISSI'!AE31","v":0},{"$f":"+'5) INPUT COSTI FISSI'!AF31","v":0},{"$f":"+'5) INPUT COSTI FISSI'!AG31","v":0},{"$f":"+'5) INPUT COSTI FISSI'!AH31","v":0},{"$f":"+'5) INPUT COSTI FISSI'!AI31","v":0},{"$f":"+'5) INPUT COSTI FISSI'!AJ31","v":0},{"$f":"+'5) INPUT COSTI FISSI'!AK31","v":0},{"$f":"+'5) INPUT COSTI FISSI'!AL31","v":0},{"$f":"+'5) INPUT COSTI FISSI'!AM31","v":0},{"$f":"+'5) INPUT COSTI FISSI'!AN31","v":0},{"$f":"+'5) INPUT COSTI FISSI'!AO31","v":0},{"$f":"+'5) INPUT COSTI FISSI'!AP31","v":0}]
[{"$f":"+'5) INPUT COSTI FISSI'!A32","v":"Altri costi fissi"},{"$f":"+'5) INPUT COSTI FISSI'!B32","v":0},{"$f":"+'5) INPUT COSTI FISSI'!C32","v":0},{"$f":"+'5) INPUT COSTI FISSI'!D32","v":0},{"$f":"+'5) INPUT COSTI FISSI'!E32","v":0},{"$f":"+'5) INPUT COSTI FISSI'!F32","v":0},{"$f":"+'5) INPUT COSTI FISSI'!G32","v":0},{"$f":"+'5) INPUT COSTI FISSI'!H32","v":0},{"$f":"+'5) INPUT COSTI FISSI'!I32","v":0},{"$f":"+'5) INPUT COSTI FISSI'!J32","v":0},{"$f":"+'5) INPUT COSTI FISSI'!K32","v":0},{"$f":"+'5) INPUT COSTI FISSI'!L32","v":0},{"$f":"+'5) INPUT COSTI FISSI'!M32","v":0},{"$f":"+'5) INPUT COSTI FISSI'!N32","v":0},null,{"$f":"+'5) INPUT COSTI FISSI'!P32","v":0},{"$f":"+'5) INPUT COSTI FISSI'!Q32","v":0},{"$f":"+'5) INPUT COSTI FISSI'!R32","v":0},{"$f":"+'5) INPUT COSTI FISSI'!S32","v":0},{"$f":"+'5) INPUT COSTI FISSI'!T32","v":0},{"$f":"+'5) INPUT COSTI FISSI'!U32","v":0},{"$f":"+'5) INPUT COSTI FISSI'!V32","v":0},{"$f":"+'5) INPUT COSTI FISSI'!W32","v":0},{"$f":"+'5) INPUT COSTI FISSI'!X32","v":0},{"$f":"+'5) INPUT COSTI FISSI'!Y32","v":0},{"$f":"+'5) INPUT COSTI FISSI'!Z32","v":0},{"$f":"+'5) INPUT COSTI FISSI'!AA32","v":0},{"$f":"+'5) INPUT COSTI FISSI'!AB32","v":0},null,{"$f":"+'5) INPUT COSTI FISSI'!AD32","v":0},{"$f":"+'5) INPUT COSTI FISSI'!AE32","v":0},{"$f":"+'5) INPUT COSTI FISSI'!AF32","v":0},{"$f":"+'5) INPUT COSTI FISSI'!AG32","v":0},{"$f":"+'5) INPUT COSTI FISSI'!AH32","v":0},{"$f":"+'5) INPUT COSTI FISSI'!AI32","v":0},{"$f":"+'5) INPUT COSTI FISSI'!AJ32","v":0},{"$f":"+'5) INPUT COSTI FISSI'!AK32","v":0},{"$f":"+'5) INPUT COSTI FISSI'!AL32","v":0},{"$f":"+'5) INPUT COSTI FISSI'!AM32","v":0},{"$f":"+'5) INPUT COSTI FISSI'!AN32","v":0},{"$f":"+'5) INPUT COSTI FISSI'!AO32","v":0},{"$f":"+'5) INPUT COSTI FISSI'!AP32","v":0}]
[{"$f":"+'5) INPUT COSTI FISSI'!A33","v":"Altri costi fissi"},{"$f":"+'5) INPUT COSTI FISSI'!B33","v":0},{"$f":"+'5) INPUT COSTI FISSI'!C33","v":0},{"$f":"+'5) INPUT COSTI FISSI'!D33","v":0},{"$f":"+'5) INPUT COSTI FISSI'!E33","v":0},{"$f":"+'5) INPUT COSTI FISSI'!F33","v":0},{"$f":"+'5) INPUT COSTI FISSI'!G33","v":0},{"$f":"+'5) INPUT COSTI FISSI'!H33","v":0},{"$f":"+'5) INPUT COSTI FISSI'!I33","v":0},{"$f":"+'5) INPUT COSTI FISSI'!J33","v":0},{"$f":"+'5) INPUT COSTI FISSI'!K33","v":0},{"$f":"+'5) INPUT COSTI FISSI'!L33","v":0},{"$f":"+'5) INPUT COSTI FISSI'!M33","v":0},{"$f":"+'5) INPUT COSTI FISSI'!N33","v":0},null,{"$f":"+'5) INPUT COSTI FISSI'!P33","v":0},{"$f":"+'5) INPUT COSTI FISSI'!Q33","v":0},{"$f":"+'5) INPUT COSTI FISSI'!R33","v":0},{"$f":"+'5) INPUT COSTI FISSI'!S33","v":0},{"$f":"+'5) INPUT COSTI FISSI'!T33","v":0},{"$f":"+'5) INPUT COSTI FISSI'!U33","v":0},{"$f":"+'5) INPUT COSTI FISSI'!V33","v":0},{"$f":"+'5) INPUT COSTI FISSI'!W33","v":0},{"$f":"+'5) INPUT COSTI FISSI'!X33","v":0},{"$f":"+'5) INPUT COSTI FISSI'!Y33","v":0},{"$f":"+'5) INPUT COSTI FISSI'!Z33","v":0},{"$f":"+'5) INPUT COSTI FISSI'!AA33","v":0},{"$f":"+'5) INPUT COSTI FISSI'!AB33","v":0},null,{"$f":"+'5) INPUT COSTI FISSI'!AD33","v":0},{"$f":"+'5) INPUT COSTI FISSI'!AE33","v":0},{"$f":"+'5) INPUT COSTI FISSI'!AF33","v":0},{"$f":"+'5) INPUT COSTI FISSI'!AG33","v":0},{"$f":"+'5) INPUT COSTI FISSI'!AH33","v":0},{"$f":"+'5) INPUT COSTI FISSI'!AI33","v":0},{"$f":"+'5) INPUT COSTI FISSI'!AJ33","v":0},{"$f":"+'5) INPUT COSTI FISSI'!AK33","v":0},{"$f":"+'5) INPUT COSTI FISSI'!AL33","v":0},{"$f":"+'5) INPUT COSTI FISSI'!AM33","v":0},{"$f":"+'5) INPUT COSTI FISSI'!AN33","v":0},{"$f":"+'5) INPUT COSTI FISSI'!AO33","v":0},{"$f":"+'5) INPUT COSTI FISSI'!AP33","v":0}]
[{"$f":"+'5) INPUT COSTI FISSI'!A34","v":"Altri costi fissi"},{"$f":"+'5) INPUT COSTI FISSI'!B34","v":0},{"$f":"+'5) INPUT COSTI FISSI'!C34","v":0},{"$f":"+'5) INPUT COSTI FISSI'!D34","v":0},{"$f":"+'5) INPUT COSTI FISSI'!E34","v":0},{"$f":"+'5) INPUT COSTI FISSI'!F34","v":0},{"$f":"+'5) INPUT COSTI FISSI'!G34","v":0},{"$f":"+'5) INPUT COSTI FISSI'!H34","v":0},{"$f":"+'5) INPUT COSTI FISSI'!I34","v":0},{"$f":"+'5) INPUT COSTI FISSI'!J34","v":0},{"$f":"+'5) INPUT COSTI FISSI'!K34","v":0},{"$f":"+'5) INPUT COSTI FISSI'!L34","v":0},{"$f":"+'5) INPUT COSTI FISSI'!M34","v":0},{"$f":"+'5) INPUT COSTI FISSI'!N34","v":0},null,{"$f":"+'5) INPUT COSTI FISSI'!P34","v":0},{"$f":"+'5) INPUT COSTI FISSI'!Q34","v":0},{"$f":"+'5) INPUT COSTI FISSI'!R34","v":0},{"$f":"+'5) INPUT COSTI FISSI'!S34","v":0},{"$f":"+'5) INPUT COSTI FISSI'!T34","v":0},{"$f":"+'5) INPUT COSTI FISSI'!U34","v":0},{"$f":"+'5) INPUT COSTI FISSI'!V34","v":0},{"$f":"+'5) INPUT COSTI FISSI'!W34","v":0},{"$f":"+'5) INPUT COSTI FISSI'!X34","v":0},{"$f":"+'5) INPUT COSTI FISSI'!Y34","v":0},{"$f":"+'5) INPUT COSTI FISSI'!Z34","v":0},{"$f":"+'5) INPUT COSTI FISSI'!AA34","v":0},{"$f":"+'5) INPUT COSTI FISSI'!AB34","v":0},null,{"$f":"+'5) INPUT COSTI FISSI'!AD34","v":0},{"$f":"+'5) INPUT COSTI FISSI'!AE34","v":0},{"$f":"+'5) INPUT COSTI FISSI'!AF34","v":0},{"$f":"+'5) INPUT COSTI FISSI'!AG34","v":0},{"$f":"+'5) INPUT COSTI FISSI'!AH34","v":0},{"$f":"+'5) INPUT COSTI FISSI'!AI34","v":0},{"$f":"+'5) INPUT COSTI FISSI'!AJ34","v":0},{"$f":"+'5) INPUT COSTI FISSI'!AK34","v":0},{"$f":"+'5) INPUT COSTI FISSI'!AL34","v":0},{"$f":"+'5) INPUT COSTI FISSI'!AM34","v":0},{"$f":"+'5) INPUT COSTI FISSI'!AN34","v":0},{"$f":"+'5) INPUT COSTI FISSI'!AO34","v":0},{"$f":"+'5) INPUT COSTI FISSI'!AP34","v":0}]
[{"$f":"+'5) INPUT COSTI FISSI'!A35","v":"Altri costi fissi"},{"$f":"+'5) INPUT COSTI FISSI'!B35","v":0},{"$f":"+'5) INPUT COSTI FISSI'!C35","v":0},{"$f":"+'5) INPUT COSTI FISSI'!D35","v":0},{"$f":"+'5) INPUT COSTI FISSI'!E35","v":0},{"$f":"+'5) INPUT COSTI FISSI'!F35","v":0},{"$f":"+'5) INPUT COSTI FISSI'!G35","v":0},{"$f":"+'5) INPUT COSTI FISSI'!H35","v":0},{"$f":"+'5) INPUT COSTI FISSI'!I35","v":0},{"$f":"+'5) INPUT COSTI FISSI'!J35","v":0},{"$f":"+'5) INPUT COSTI FISSI'!K35","v":0},{"$f":"+'5) INPUT COSTI FISSI'!L35","v":0},{"$f":"+'5) INPUT COSTI FISSI'!M35","v":0},{"$f":"+'5) INPUT COSTI FISSI'!N35","v":0},null,{"$f":"+'5) INPUT COSTI FISSI'!P35","v":0},{"$f":"+'5) INPUT COSTI FISSI'!Q35","v":0},{"$f":"+'5) INPUT COSTI FISSI'!R35","v":0},{"$f":"+'5) INPUT COSTI FISSI'!S35","v":0},{"$f":"+'5) INPUT COSTI FISSI'!T35","v":0},{"$f":"+'5) INPUT COSTI FISSI'!U35","v":0},{"$f":"+'5) INPUT COSTI FISSI'!V35","v":0},{"$f":"+'5) INPUT COSTI FISSI'!W35","v":0},{"$f":"+'5) INPUT COSTI FISSI'!X35","v":0},{"$f":"+'5) INPUT COSTI FISSI'!Y35","v":0},{"$f":"+'5) INPUT COSTI FISSI'!Z35","v":0},{"$f":"+'5) INPUT COSTI FISSI'!AA35","v":0},{"$f":"+'5) INPUT COSTI FISSI'!AB35","v":0},null,{"$f":"+'5) INPUT COSTI FISSI'!AD35","v":0},{"$f":"+'5) INPUT COSTI FISSI'!AE35","v":0},{"$f":"+'5) INPUT COSTI FISSI'!AF35","v":0},{"$f":"+'5) INPUT COSTI FISSI'!AG35","v":0},{"$f":"+'5) INPUT COSTI FISSI'!AH35","v":0},{"$f":"+'5) INPUT COSTI FISSI'!AI35","v":0},{"$f":"+'5) INPUT COSTI FISSI'!AJ35","v":0},{"$f":"+'5) INPUT COSTI FISSI'!AK35","v":0},{"$f":"+'5) INPUT COSTI FISSI'!AL35","v":0},{"$f":"+'5) INPUT COSTI FISSI'!AM35","v":0},{"$f":"+'5) INPUT COSTI FISSI'!AN35","v":0},{"$f":"+'5) INPUT COSTI FISSI'!AO35","v":0},{"$f":"+'5) INPUT COSTI FISSI'!AP35","v":0}]
["RATA FINANZIAMENTO",{"$f":"IF($A$123=\"LEVERED\",_xlfn.IFNA(VLOOKUP(B4,'7) INPUT FINANZIAMENTO'!$A$27:$K$387,5,FALSE),0),0)","v":0},{"$f":"IF($A$123=\"LEVERED\",_xlfn.IFNA(VLOOKUP(C4,'7) INPUT FINANZIAMENTO'!$A$27:$K$387,5,FALSE),0),0)","v":0},{"$f":"IF($A$123=\"LEVERED\",_xlfn.IFNA(VLOOKUP(D4,'7) INPUT FINANZIAMENTO'!$A$27:$K$387,5,FALSE),0),0)","v":0},{"$f":"IF($A$123=\"LEVERED\",_xlfn.IFNA(VLOOKUP(E4,'7) INPUT FINANZIAMENTO'!$A$27:$K$387,5,FALSE),0),0)","v":0},{"$f":"IF($A$123=\"LEVERED\",_xlfn.IFNA(VLOOKUP(F4,'7) INPUT FINANZIAMENTO'!$A$27:$K$387,5,FALSE),0),0)","v":0},{"$f":"IF($A$123=\"LEVERED\",_xlfn.IFNA(VLOOKUP(G4,'7) INPUT FINANZIAMENTO'!$A$27:$K$387,5,FALSE),0),0)","v":0},{"$f":"IF($A$123=\"LEVERED\",_xlfn.IFNA(VLOOKUP(H4,'7) INPUT FINANZIAMENTO'!$A$27:$K$387,5,FALSE),0),0)","v":0},{"$f":"IF($A$123=\"LEVERED\",_xlfn.IFNA(VLOOKUP(I4,'7) INPUT FINANZIAMENTO'!$A$27:$K$387,5,FALSE),0),0)","v":0},{"$f":"IF($A$123=\"LEVERED\",_xlfn.IFNA(VLOOKUP(J4,'7) INPUT FINANZIAMENTO'!$A$27:$K$387,5,FALSE),0),0)","v":0},{"$f":"IF($A$123=\"LEVERED\",_xlfn.IFNA(VLOOKUP(K4,'7) INPUT FINANZIAMENTO'!$A$27:$K$387,5,FALSE),0),0)","v":0},{"$f":"IF($A$123=\"LEVERED\",_xlfn.IFNA(VLOOKUP(L4,'7) INPUT FINANZIAMENTO'!$A$27:$K$387,5,FALSE),0),0)","v":0},{"$f":"IF($A$123=\"LEVERED\",_xlfn.IFNA(VLOOKUP(M4,'7) INPUT FINANZIAMENTO'!$A$27:$K$387,5,FALSE),0),0)","v":0},{"$f":"SUM(B105:M105)","v":0},null,{"$f":"IF($A$123=\"LEVERED\",_xlfn.IFNA(VLOOKUP(P4,'7) INPUT FINANZIAMENTO'!$A$27:$K$387,5,FALSE),0),0)","v":0},{"$f":"IF($A$123=\"LEVERED\",_xlfn.IFNA(VLOOKUP(Q4,'7) INPUT FINANZIAMENTO'!$A$27:$K$387,5,FALSE),0),0)","v":0},{"$f":"IF($A$123=\"LEVERED\",_xlfn.IFNA(VLOOKUP(R4,'7) INPUT FINANZIAMENTO'!$A$27:$K$387,5,FALSE),0),0)","v":0},{"$f":"IF($A$123=\"LEVERED\",_xlfn.IFNA(VLOOKUP(S4,'7) INPUT FINANZIAMENTO'!$A$27:$K$387,5,FALSE),0),0)","v":0},{"$f":"IF($A$123=\"LEVERED\",_xlfn.IFNA(VLOOKUP(T4,'7) INPUT FINANZIAMENTO'!$A$27:$K$387,5,FALSE),0),0)","v":0},{"$f":"IF($A$123=\"LEVERED\",_xlfn.IFNA(VLOOKUP(U4,'7) INPUT FINANZIAMENTO'!$A$27:$K$387,5,FALSE),0),0)","v":0},{"$f":"IF($A$123=\"LEVERED\",_xlfn.IFNA(VLOOKUP(V4,'7) INPUT FINANZIAMENTO'!$A$27:$K$387,5,FALSE),0),0)","v":0},{"$f":"IF($A$123=\"LEVERED\",_xlfn.IFNA(VLOOKUP(W4,'7) INPUT FINANZIAMENTO'!$A$27:$K$387,5,FALSE),0),0)","v":0},{"$f":"IF($A$123=\"LEVERED\",_xlfn.IFNA(VLOOKUP(X4,'7) INPUT FINANZIAMENTO'!$A$27:$K$387,5,FALSE),0),0)","v":0},{"$f":"IF($A$123=\"LEVERED\",_xlfn.IFNA(VLOOKUP(Y4,'7) INPUT FINANZIAMENTO'!$A$27:$K$387,5,FALSE),0),0)","v":0},{"$f":"IF($A$123=\"LEVERED\",_xlfn.IFNA(VLOOKUP(Z4,'7) INPUT FINANZIAMENTO'!$A$27:$K$387,5,FALSE),0),0)","v":0},{"$f":"IF($A$123=\"LEVERED\",_xlfn.IFNA(VLOOKUP(AA4,'7) INPUT FINANZIAMENTO'!$A$27:$K$387,5,FALSE),0),0)","v":0},{"$f":"SUM(P105:AA105)","v":0},null,{"$f":"IF($A$123=\"LEVERED\",_xlfn.IFNA(VLOOKUP(AD4,'7) INPUT FINANZIAMENTO'!$A$27:$K$387,5,FALSE),0),0)","v":0},{"$f":"IF($A$123=\"LEVERED\",_xlfn.IFNA(VLOOKUP(AE4,'7) INPUT FINANZIAMENTO'!$A$27:$K$387,5,FALSE),0),0)","v":0},{"$f":"IF($A$123=\"LEVERED\",_xlfn.IFNA(VLOOKUP(AF4,'7) INPUT FINANZIAMENTO'!$A$27:$K$387,5,FALSE),0),0)","v":0},{"$f":"IF($A$123=\"LEVERED\",_xlfn.IFNA(VLOOKUP(AG4,'7) INPUT FINANZIAMENTO'!$A$27:$K$387,5,FALSE),0),0)","v":0},{"$f":"IF($A$123=\"LEVERED\",_xlfn.IFNA(VLOOKUP(AH4,'7) INPUT FINANZIAMENTO'!$A$27:$K$387,5,FALSE),0),0)","v":0},{"$f":"IF($A$123=\"LEVERED\",_xlfn.IFNA(VLOOKUP(AI4,'7) INPUT FINANZIAMENTO'!$A$27:$K$387,5,FALSE),0),0)","v":0},{"$f":"IF($A$123=\"LEVERED\",_xlfn.IFNA(VLOOKUP(AJ4,'7) INPUT FINANZIAMENTO'!$A$27:$K$387,5,FALSE),0),0)","v":0},{"$f":"IF($A$123=\"LEVERED\",_xlfn.IFNA(VLOOKUP(AK4,'7) INPUT FINANZIAMENTO'!$A$27:$K$387,5,FALSE),0),0)","v":0},{"$f":"IF($A$123=\"LEVERED\",_xlfn.IFNA(VLOOKUP(AL4,'7) INPUT FINANZIAMENTO'!$A$27:$K$387,5,FALSE),0),0)","v":0},{"$f":"IF($A$123=\"LEVERED\",_xlfn.IFNA(VLOOKUP(AM4,'7) INPUT FINANZIAMENTO'!$A$27:$K$387,5,FALSE),0),0)","v":0},{"$f":"IF($A$123=\"LEVERED\",_xlfn.IFNA(VLOOKUP(AN4,'7) INPUT FINANZIAMENTO'!$A$27:$K$387,5,FALSE),0),0)","v":0},{"$f":"IF($A$123=\"LEVERED\",_xlfn.IFNA(VLOOKUP(AO4,'7) INPUT FINANZIAMENTO'!$A$27:$K$387,5,FALSE),0),0)","v":0},{"$f":"SUM(AD105:AO105)","v":0}]
["TOTALE",{"$f":"SUM(B72:B105)","v":530},{"$f":"SUM(C72:C105)","v":390},{"$f":"SUM(D72:D105)","v":230},440,230,390,280,390,230,440,230,1140,4920,null,530,390,230,440,230,390,280,390,230,440,230,1140,4920,null,530,390,230,440,230,390,280,390,230,440,230,1140,4920]
[]
["USCITE VARIABILI",{"$f":"+B71","v":"2016-04-30"},{"$f":"+C71","v":"2016-05-31"},"2016-06-30","2016-07-31","2016-08-31","2016-09-30","2016-10-31","2016-11-30","2016-12-31","2017-01-31","2017-02-28","2017-03-31","TOTALE",null,"2017-04-30","2017-05-31","2017-06-30","2017-07-31","2017-08-31","2017-09-30","2017-10-31","2017-11-30","2017-12-31","2018-01-31","2018-02-28","2018-03-31","TOTALE",null,"2018-04-30","2018-05-31","2018-06-30","2018-07-31","2018-08-31","2018-09-30","2018-10-31","2018-11-30","2018-12-31","2019-01-31","2019-02-28","2019-03-31","TOTALE"]
[{"$f":"+'6) INPUT COSTI VARIABILI'!B40","v":"Materie prime colazione"},{"$f":"+'6) INPUT COSTI VARIABILI'!C40","v":36},{"$f":"+'6) INPUT COSTI VARIABILI'!D40","v":93},{"$f":"+'6) INPUT COSTI VARIABILI'!E40","v":162},{"$f":"+'6) INPUT COSTI VARIABILI'!F40","v":167.4},{"$f":"+'6) INPUT COSTI VARIABILI'!G40","v":167.4},{"$f":"+'6) INPUT COSTI VARIABILI'!H40","v":90},{"$f":"+'6) INPUT COSTI VARIABILI'!I40","v":37.200000000000003},{"$f":"+'6) INPUT COSTI VARIABILI'!J40","v":36},{"$f":"+'6) INPUT COSTI VARIABILI'!K40","v":167.4},{"$f":"+'6) INPUT COSTI VARIABILI'!L40","v":37.200000000000003},{"$f":"+'6) INPUT COSTI VARIABILI'!M40","v":33.6},{"$f":"+'6) INPUT COSTI VARIABILI'!N40","v":37.200000000000003},{"$f":"SUM(B109:M109)","v":1064.4000000000001},null,{"$f":"+'6) INPUT COSTI VARIABILI'!R40","v":36},{"$f":"+'6) INPUT COSTI VARIABILI'!S40","v":93},{"$f":"+'6) INPUT COSTI VARIABILI'!T40","v":162},{"$f":"+'6) INPUT COSTI VARIABILI'!U40","v":167.4},{"$f":"+'6) INPUT COSTI VARIABILI'!V40","v":167.4},{"$f":"+'6) INPUT COSTI VARIABILI'!W40","v":90},{"$f":"+'6) INPUT COSTI VARIABILI'!X40","v":37.200000000000003},{"$f":"+'6) INPUT COSTI VARIABILI'!Y40","v":36},{"$f":"+'6) INPUT COSTI VARIABILI'!Z40","v":167.4},{"$f":"+'6) INPUT COSTI VARIABILI'!AA40","v":37.200000000000003},{"$f":"+'6) INPUT COSTI VARIABILI'!AB40","v":33.6},{"$f":"+'6) INPUT COSTI VARIABILI'!AC40","v":37.200000000000003},{"$f":"SUM(P109:AA109)","v":1064.4000000000001},null,{"$f":"+'6) INPUT COSTI VARIABILI'!AG40","v":36},{"$f":"+'6) INPUT COSTI VARIABILI'!AH40","v":93},{"$f":"+'6) INPUT COSTI VARIABILI'!AI40","v":162},{"$f":"+'6) INPUT COSTI VARIABILI'!AJ40","v":167.4},{"$f":"+'6) INPUT COSTI VARIABILI'!AK40","v":167.4},{"$f":"+'6) INPUT COSTI VARIABILI'!AL40","v":90},{"$f":"+'6) INPUT COSTI VARIABILI'!AM40","v":37.200000000000003},{"$f":"+'6) INPUT COSTI VARIABILI'!AN40","v":36},{"$f":"+'6) INPUT COSTI VARIABILI'!AO40","v":167.4},{"$f":"+'6) INPUT COSTI VARIABILI'!AP40","v":37.200000000000003},{"$f":"+'6) INPUT COSTI VARIABILI'!AQ40","v":33.6},{"$f":"+'6) INPUT COSTI VARIABILI'!AR40","v":37.200000000000003},{"$f":"SUM(AD109:AO109)","v":1064.4000000000001}]
[{"$f":"+'6) INPUT COSTI VARIABILI'!B41","v":"Materiale di consumo ospiti"},{"$f":"+'6) INPUT COSTI VARIABILI'!C41","v":6},{"$f":"+'6) INPUT COSTI VARIABILI'!D41","v":21.7},{"$f":"+'6) INPUT COSTI VARIABILI'!E41","v":48.6},{"$f":"+'6) INPUT COSTI VARIABILI'!F41","v":50.22},{"$f":"+'6) INPUT COSTI VARIABILI'!G41","v":50.22},{"$f":"+'6) INPUT COSTI VARIABILI'!H41","v":21},{"$f":"+'6) INPUT COSTI VARIABILI'!I41","v":6.2},{"$f":"+'6) INPUT COSTI VARIABILI'!J41","v":6},{"$f":"+'6) INPUT COSTI VARIABILI'!K41","v":50.22},{"$f":"+'6) INPUT COSTI VARIABILI'!L41","v":6.2},{"$f":"+'6) INPUT COSTI VARIABILI'!M41","v":5.6000000000000005},{"$f":"+'6) INPUT COSTI VARIABILI'!N41","v":6.2},{"$f":"SUM(B110:M110)","v":278.15999999999997},null,{"$f":"+'6) INPUT COSTI VARIABILI'!R41","v":6},{"$f":"+'6) INPUT COSTI VARIABILI'!S41","v":21.7},{"$f":"+'6) INPUT COSTI VARIABILI'!T41","v":48.6},{"$f":"+'6) INPUT COSTI VARIABILI'!U41","v":50.22},{"$f":"+'6) INPUT COSTI VARIABILI'!V41","v":50.22},{"$f":"+'6) INPUT COSTI VARIABILI'!W41","v":21},{"$f":"+'6) INPUT COSTI VARIABILI'!X41","v":6.2},{"$f":"+'6) INPUT COSTI VARIABILI'!Y41","v":6},{"$f":"+'6) INPUT COSTI VARIABILI'!Z41","v":50.22},{"$f":"+'6) INPUT COSTI VARIABILI'!AA41","v":6.2},{"$f":"+'6) INPUT COSTI VARIABILI'!AB41","v":5.6000000000000005},{"$f":"+'6) INPUT COSTI VARIABILI'!AC41","v":6.2},{"$f":"SUM(P110:AA110)","v":278.15999999999997},null,{"$f":"+'6) INPUT COSTI VARIABILI'!AG41","v":6},{"$f":"+'6) INPUT COSTI VARIABILI'!AH41","v":21.7},{"$f":"+'6) INPUT COSTI VARIABILI'!AI41","v":48.6},{"$f":"+'6) INPUT COSTI VARIABILI'!AJ41","v":50.22},{"$f":"+'6) INPUT COSTI VARIABILI'!AK41","v":50.22},{"$f":"+'6) INPUT COSTI VARIABILI'!AL41","v":21},{"$f":"+'6) INPUT COSTI VARIABILI'!AM41","v":6.2},{"$f":"+'6) INPUT COSTI VARIABILI'!AN41","v":6},{"$f":"+'6) INPUT COSTI VARIABILI'!AO41","v":50.22},{"$f":"+'6) INPUT COSTI VARIABILI'!AP41","v":6.2},{"$f":"+'6) INPUT COSTI VARIABILI'!AQ41","v":5.6000000000000005},{"$f":"+'6) INPUT COSTI VARIABILI'!AR41","v":6.2},{"$f":"SUM(AD110:AO110)","v":278.15999999999997}]
[{"$f":"+'6) INPUT COSTI VARIABILI'!B42","v":"Materiale di consumo pulizia"},{"$f":"+'6) INPUT COSTI VARIABILI'!C42","v":6},{"$f":"+'6) INPUT COSTI VARIABILI'!D42","v":21.7},{"$f":"+'6) INPUT COSTI VARIABILI'!E42","v":48.6},{"$f":"+'6) INPUT COSTI VARIABILI'!F42","v":50.22},{"$f":"+'6) INPUT COSTI VARIABILI'!G42","v":50.22},{"$f":"+'6) INPUT COSTI VARIABILI'!H42","v":21},{"$f":"+'6) INPUT COSTI VARIABILI'!I42","v":6.2},{"$f":"+'6) INPUT COSTI VARIABILI'!J42","v":6},{"$f":"+'6) INPUT COSTI VARIABILI'!K42","v":50.22},{"$f":"+'6) INPUT COSTI VARIABILI'!L42","v":6.2},{"$f":"+'6) INPUT COSTI VARIABILI'!M42","v":5.6000000000000005},{"$f":"+'6) INPUT COSTI VARIABILI'!N42","v":6.2},278.15999999999997,null,{"$f":"+'6) INPUT COSTI VARIABILI'!R42","v":6},{"$f":"+'6) INPUT COSTI VARIABILI'!S42","v":21.7},{"$f":"+'6) INPUT COSTI VARIABILI'!T42","v":48.6},{"$f":"+'6) INPUT COSTI VARIABILI'!U42","v":50.22},{"$f":"+'6) INPUT COSTI VARIABILI'!V42","v":50.22},{"$f":"+'6) INPUT COSTI VARIABILI'!W42","v":21},{"$f":"+'6) INPUT COSTI VARIABILI'!X42","v":6.2},{"$f":"+'6) INPUT COSTI VARIABILI'!Y42","v":6},{"$f":"+'6) INPUT COSTI VARIABILI'!Z42","v":50.22},{"$f":"+'6) INPUT COSTI VARIABILI'!AA42","v":6.2},{"$f":"+'6) INPUT COSTI VARIABILI'!AB42","v":5.6000000000000005},{"$f":"+'6) INPUT COSTI VARIABILI'!AC42","v":6.2},278.15999999999997,null,{"$f":"+'6) INPUT COSTI VARIABILI'!AG42","v":6},{"$f":"+'6) INPUT COSTI VARIABILI'!AH42","v":21.7},{"$f":"+'6) INPUT COSTI VARIABILI'!AI42","v":48.6},{"$f":"+'6) INPUT COSTI VARIABILI'!AJ42","v":50.22},{"$f":"+'6) INPUT COSTI VARIABILI'!AK42","v":50.22},{"$f":"+'6) INPUT COSTI VARIABILI'!AL42","v":21},{"$f":"+'6) INPUT COSTI VARIABILI'!AM42","v":6.2},{"$f":"+'6) INPUT COSTI VARIABILI'!AN42","v":6},{"$f":"+'6) INPUT COSTI VARIABILI'!AO42","v":50.22},{"$f":"+'6) INPUT COSTI VARIABILI'!AP42","v":6.2},{"$f":"+'6) INPUT COSTI VARIABILI'!AQ42","v":5.6000000000000005},{"$f":"+'6) INPUT COSTI VARIABILI'!AR42","v":6.2},278.15999999999997]
[{"$f":"+'6) INPUT COSTI VARIABILI'!B43","v":"Servizi di lavanderia"},{"$f":"+'6) INPUT COSTI VARIABILI'!C43","v":30},{"$f":"+'6) INPUT COSTI VARIABILI'!D43","v":108.5},{"$f":"+'6) INPUT COSTI VARIABILI'!E43","v":243},{"$f":"+'6) INPUT COSTI VARIABILI'!F43","v":251.10000000000002},{"$f":"+'6) INPUT COSTI VARIABILI'!G43","v":251.10000000000002},{"$f":"+'6) INPUT COSTI VARIABILI'!H43","v":105},{"$f":"+'6) INPUT COSTI VARIABILI'!I43","v":31},{"$f":"+'6) INPUT COSTI VARIABILI'!J43","v":30},{"$f":"+'6) INPUT COSTI VARIABILI'!K43","v":251.10000000000002},{"$f":"+'6) INPUT COSTI VARIABILI'!L43","v":31},{"$f":"+'6) INPUT COSTI VARIABILI'!M43","v":28},{"$f":"+'6) INPUT COSTI VARIABILI'!N43","v":31},1390.8000000000002,null,{"$f":"+'6) INPUT COSTI VARIABILI'!R43","v":30},{"$f":"+'6) INPUT COSTI VARIABILI'!S43","v":108.5},{"$f":"+'6) INPUT COSTI VARIABILI'!T43","v":243},{"$f":"+'6) INPUT COSTI VARIABILI'!U43","v":251.10000000000002},{"$f":"+'6) INPUT COSTI VARIABILI'!V43","v":251.10000000000002},{"$f":"+'6) INPUT COSTI VARIABILI'!W43","v":105},{"$f":"+'6) INPUT COSTI VARIABILI'!X43","v":31},{"$f":"+'6) INPUT COSTI VARIABILI'!Y43","v":30},{"$f":"+'6) INPUT COSTI VARIABILI'!Z43","v":251.10000000000002},{"$f":"+'6) INPUT COSTI VARIABILI'!AA43","v":31},{"$f":"+'6) INPUT COSTI VARIABILI'!AB43","v":28},{"$f":"+'6) INPUT COSTI VARIABILI'!AC43","v":31},1390.8000000000002,null,{"$f":"+'6) INPUT COSTI VARIABILI'!AG43","v":30},{"$f":"+'6) INPUT COSTI VARIABILI'!AH43","v":108.5},{"$f":"+'6) INPUT COSTI VARIABILI'!AI43","v":243},{"$f":"+'6) INPUT COSTI VARIABILI'!AJ43","v":251.10000000000002},{"$f":"+'6) INPUT COSTI VARIABILI'!AK43","v":251.10000000000002},{"$f":"+'6) INPUT COSTI VARIABILI'!AL43","v":105},{"$f":"+'6) INPUT COSTI VARIABILI'!AM43","v":31},{"$f":"+'6) INPUT COSTI VARIABILI'!AN43","v":30},{"$f":"+'6) INPUT COSTI VARIABILI'!AO43","v":251.10000000000002},{"$f":"+'6) INPUT COSTI VARIABILI'!AP43","v":31},{"$f":"+'6) INPUT COSTI VARIABILI'!AQ43","v":28},{"$f":"+'6) INPUT COSTI VARIABILI'!AR43","v":31},1390.8000000000002]
[{"$f":"+'6) INPUT COSTI VARIABILI'!B44","v":"Visite guidate"},{"$f":"+'6) INPUT COSTI VARIABILI'!C44","v":0},{"$f":"+'6) INPUT COSTI VARIABILI'!D44","v":0},{"$f":"+'6) INPUT COSTI VARIABILI'!E44","v":0},{"$f":"+'6) INPUT COSTI VARIABILI'!F44","v":0},{"$f":"+'6) INPUT COSTI VARIABILI'!G44","v":0},{"$f":"+'6) INPUT COSTI VARIABILI'!H44","v":0},{"$f":"+'6) INPUT COSTI VARIABILI'!I44","v":0},{"$f":"+'6) INPUT COSTI VARIABILI'!J44","v":0},{"$f":"+'6) INPUT COSTI VARIABILI'!K44","v":0},{"$f":"+'6) INPUT COSTI VARIABILI'!L44","v":0},{"$f":"+'6) INPUT COSTI VARIABILI'!M44","v":0},{"$f":"+'6) INPUT COSTI VARIABILI'!N44","v":0},0,null,{"$f":"+'6) INPUT COSTI VARIABILI'!R44","v":0},{"$f":"+'6) INPUT COSTI VARIABILI'!S44","v":0},{"$f":"+'6) INPUT COSTI VARIABILI'!T44","v":0},{"$f":"+'6) INPUT COSTI VARIABILI'!U44","v":0},{"$f":"+'6) INPUT COSTI VARIABILI'!V44","v":0},{"$f":"+'6) INPUT COSTI VARIABILI'!W44","v":0},{"$f":"+'6) INPUT COSTI VARIABILI'!X44","v":0},{"$f":"+'6) INPUT COSTI VARIABILI'!Y44","v":0},{"$f":"+'6) INPUT COSTI VARIABILI'!Z44","v":0},{"$f":"+'6) INPUT COSTI VARIABILI'!AA44","v":0},{"$f":"+'6) INPUT COSTI VARIABILI'!AB44","v":0},{"$f":"+'6) INPUT COSTI VARIABILI'!AC44","v":0},0,null,{"$f":"+'6) INPUT COSTI VARIABILI'!AG44","v":0},{"$f":"+'6) INPUT COSTI VARIABILI'!AH44","v":0},{"$f":"+'6) INPUT COSTI VARIABILI'!AI44","v":0},{"$f":"+'6) INPUT COSTI VARIABILI'!AJ44","v":0},{"$f":"+'6) INPUT COSTI VARIABILI'!AK44","v":0},{"$f":"+'6) INPUT COSTI VARIABILI'!AL44","v":0},{"$f":"+'6) INPUT COSTI VARIABILI'!AM44","v":0},{"$f":"+'6) INPUT COSTI VARIABILI'!AN44","v":0},{"$f":"+'6) INPUT COSTI VARIABILI'!AO44","v":0},{"$f":"+'6) INPUT COSTI VARIABILI'!AP44","v":0},{"$f":"+'6) INPUT COSTI VARIABILI'!AQ44","v":0},{"$f":"+'6) INPUT COSTI VARIABILI'!AR44","v":0},0]
[{"$f":"+'6) INPUT COSTI VARIABILI'!B45","v":"Altri costi variabili"},{"$f":"+'6) INPUT COSTI VARIABILI'!C45","v":0},{"$f":"+'6) INPUT COSTI VARIABILI'!D45","v":0},{"$f":"+'6) INPUT COSTI VARIABILI'!E45","v":0},{"$f":"+'6) INPUT COSTI VARIABILI'!F45","v":0},{"$f":"+'6) INPUT COSTI VARIABILI'!G45","v":0},{"$f":"+'6) INPUT COSTI VARIABILI'!H45","v":0},{"$f":"+'6) INPUT COSTI VARIABILI'!I45","v":0},{"$f":"+'6) INPUT COSTI VARIABILI'!J45","v":0},{"$f":"+'6) INPUT COSTI VARIABILI'!K45","v":0},{"$f":"+'6) INPUT COSTI VARIABILI'!L45","v":0},{"$f":"+'6) INPUT COSTI VARIABILI'!M45","v":0},{"$f":"+'6) INPUT COSTI VARIABILI'!N45","v":0},0,null,{"$f":"+'6) INPUT COSTI VARIABILI'!R45","v":0},{"$f":"+'6) INPUT COSTI VARIABILI'!S45","v":0},{"$f":"+'6) INPUT COSTI VARIABILI'!T45","v":0},{"$f":"+'6) INPUT COSTI VARIABILI'!U45","v":0},{"$f":"+'6) INPUT COSTI VARIABILI'!V45","v":0},{"$f":"+'6) INPUT COSTI VARIABILI'!W45","v":0},{"$f":"+'6) INPUT COSTI VARIABILI'!X45","v":0},{"$f":"+'6) INPUT COSTI VARIABILI'!Y45","v":0},{"$f":"+'6) INPUT COSTI VARIABILI'!Z45","v":0},{"$f":"+'6) INPUT COSTI VARIABILI'!AA45","v":0},{"$f":"+'6) INPUT COSTI VARIABILI'!AB45","v":0},{"$f":"+'6) INPUT COSTI VARIABILI'!AC45","v":0},0,null,{"$f":"+'6) INPUT COSTI VARIABILI'!AG45","v":0},{"$f":"+'6) INPUT COSTI VARIABILI'!AH45","v":0},{"$f":"+'6) INPUT COSTI VARIABILI'!AI45","v":0},{"$f":"+'6) INPUT COSTI VARIABILI'!AJ45","v":0},{"$f":"+'6) INPUT COSTI VARIABILI'!AK45","v":0},{"$f":"+'6) INPUT COSTI VARIABILI'!AL45","v":0},{"$f":"+'6) INPUT COSTI VARIABILI'!AM45","v":0},{"$f":"+'6) INPUT COSTI VARIABILI'!AN45","v":0},{"$f":"+'6) INPUT COSTI VARIABILI'!AO45","v":0},{"$f":"+'6) INPUT COSTI VARIABILI'!AP45","v":0},{"$f":"+'6) INPUT COSTI VARIABILI'!AQ45","v":0},{"$f":"+'6) INPUT COSTI VARIABILI'!AR45","v":0},0]
[{"$f":"+'6) INPUT COSTI VARIABILI'!B46","v":"Altri costi variabili"},{"$f":"+'6) INPUT COSTI VARIABILI'!C46","v":0},{"$f":"+'6) INPUT COSTI VARIABILI'!D46","v":0},{"$f":"+'6) INPUT COSTI VARIABILI'!E46","v":0},{"$f":"+'6) INPUT COSTI VARIABILI'!F46","v":0},{"$f":"+'6) INPUT COSTI VARIABILI'!G46","v":0},{"$f":"+'6) INPUT COSTI VARIABILI'!H46","v":0},{"$f":"+'6) INPUT COSTI VARIABILI'!I46","v":0},{"$f":"+'6) INPUT COSTI VARIABILI'!J46","v":0},{"$f":"+'6) INPUT COSTI VARIABILI'!K46","v":0},{"$f":"+'6) INPUT COSTI VARIABILI'!L46","v":0},{"$f":"+'6) INPUT COSTI VARIABILI'!M46","v":0},{"$f":"+'6) INPUT COSTI VARIABILI'!N46","v":0},0,null,{"$f":"+'6) INPUT COSTI VARIABILI'!R46","v":0},{"$f":"+'6) INPUT COSTI VARIABILI'!S46","v":0},{"$f":"+'6) INPUT COSTI VARIABILI'!T46","v":0},{"$f":"+'6) INPUT COSTI VARIABILI'!U46","v":0},{"$f":"+'6) INPUT COSTI VARIABILI'!V46","v":0},{"$f":"+'6) INPUT COSTI VARIABILI'!W46","v":0},{"$f":"+'6) INPUT COSTI VARIABILI'!X46","v":0},{"$f":"+'6) INPUT COSTI VARIABILI'!Y46","v":0},{"$f":"+'6) INPUT COSTI VARIABILI'!Z46","v":0},{"$f":"+'6) INPUT COSTI VARIABILI'!AA46","v":0},{"$f":"+'6) INPUT COSTI VARIABILI'!AB46","v":0},{"$f":"+'6) INPUT COSTI VARIABILI'!AC46","v":0},0,null,{"$f":"+'6) INPUT COSTI VARIABILI'!AG46","v":0},{"$f":"+'6) INPUT COSTI VARIABILI'!AH46","v":0},{"$f":"+'6) INPUT COSTI VARIABILI'!AI46","v":0},{"$f":"+'6) INPUT COSTI VARIABILI'!AJ46","v":0},{"$f":"+'6) INPUT COSTI VARIABILI'!AK46","v":0},{"$f":"+'6) INPUT COSTI VARIABILI'!AL46","v":0},{"$f":"+'6) INPUT COSTI VARIABILI'!AM46","v":0},{"$f":"+'6) INPUT COSTI VARIABILI'!AN46","v":0},{"$f":"+'6) INPUT COSTI VARIABILI'!AO46","v":0},{"$f":"+'6) INPUT COSTI VARIABILI'!AP46","v":0},{"$f":"+'6) INPUT COSTI VARIABILI'!AQ46","v":0},{"$f":"+'6) INPUT COSTI VARIABILI'!AR46","v":0},0]
[{"$f":"+'6) INPUT COSTI VARIABILI'!B47","v":"Altri costi variabili"},{"$f":"+'6) INPUT COSTI VARIABILI'!C47","v":0},{"$f":"+'6) INPUT COSTI VARIABILI'!D47","v":0},{"$f":"+'6) INPUT COSTI VARIABILI'!E47","v":0},{"$f":"+'6) INPUT COSTI VARIABILI'!F47","v":0},{"$f":"+'6) INPUT COSTI VARIABILI'!G47","v":0},{"$f":"+'6) INPUT COSTI VARIABILI'!H47","v":0},{"$f":"+'6) INPUT COSTI VARIABILI'!I47","v":0},{"$f":"+'6) INPUT COSTI VARIABILI'!J47","v":0},{"$f":"+'6) INPUT COSTI VARIABILI'!K47","v":0},{"$f":"+'6) INPUT COSTI VARIABILI'!L47","v":0},{"$f":"+'6) INPUT COSTI VARIABILI'!M47","v":0},{"$f":"+'6) INPUT COSTI VARIABILI'!N47","v":0},0,null,{"$f":"+'6) INPUT COSTI VARIABILI'!R47","v":0},{"$f":"+'6) INPUT COSTI VARIABILI'!S47","v":0},{"$f":"+'6) INPUT COSTI VARIABILI'!T47","v":0},{"$f":"+'6) INPUT COSTI VARIABILI'!U47","v":0},{"$f":"+'6) INPUT COSTI VARIABILI'!V47","v":0},{"$f":"+'6) INPUT COSTI VARIABILI'!W47","v":0},{"$f":"+'6) INPUT COSTI VARIABILI'!X47","v":0},{"$f":"+'6) INPUT COSTI VARIABILI'!Y47","v":0},{"$f":"+'6) INPUT COSTI VARIABILI'!Z47","v":0},{"$f":"+'6) INPUT COSTI VARIABILI'!AA47","v":0},{"$f":"+'6) INPUT COSTI VARIABILI'!AB47","v":0},{"$f":"+'6) INPUT COSTI VARIABILI'!AC47","v":0},0,null,{"$f":"+'6) INPUT COSTI VARIABILI'!AG47","v":0},{"$f":"+'6) INPUT COSTI VARIABILI'!AH47","v":0},{"$f":"+'6) INPUT COSTI VARIABILI'!AI47","v":0},{"$f":"+'6) INPUT COSTI VARIABILI'!AJ47","v":0},{"$f":"+'6) INPUT COSTI VARIABILI'!AK47","v":0},{"$f":"+'6) INPUT COSTI VARIABILI'!AL47","v":0},{"$f":"+'6) INPUT COSTI VARIABILI'!AM47","v":0},{"$f":"+'6) INPUT COSTI VARIABILI'!AN47","v":0},{"$f":"+'6) INPUT COSTI VARIABILI'!AO47","v":0},{"$f":"+'6) INPUT COSTI VARIABILI'!AP47","v":0},{"$f":"+'6) INPUT COSTI VARIABILI'!AQ47","v":0},{"$f":"+'6) INPUT COSTI VARIABILI'!AR47","v":0},0]
[{"$f":"+'6) INPUT COSTI VARIABILI'!B48","v":"Altri costi variabili"},{"$f":"+'6) INPUT COSTI VARIABILI'!C48","v":0},{"$f":"+'6) INPUT COSTI VARIABILI'!D48","v":0},{"$f":"+'6) INPUT COSTI VARIABILI'!E48","v":0},{"$f":"+'6) INPUT COSTI VARIABILI'!F48","v":0},{"$f":"+'6) INPUT COSTI VARIABILI'!G48","v":0},{"$f":"+'6) INPUT COSTI VARIABILI'!H48","v":0},{"$f":"+'6) INPUT COSTI VARIABILI'!I48","v":0},{"$f":"+'6) INPUT COSTI VARIABILI'!J48","v":0},{"$f":"+'6) INPUT COSTI VARIABILI'!K48","v":0},{"$f":"+'6) INPUT COSTI VARIABILI'!L48","v":0},{"$f":"+'6) INPUT COSTI VARIABILI'!M48","v":0},{"$f":"+'6) INPUT COSTI VARIABILI'!N48","v":0},0,null,{"$f":"+'6) INPUT COSTI VARIABILI'!R48","v":0},{"$f":"+'6) INPUT COSTI VARIABILI'!S48","v":0},{"$f":"+'6) INPUT COSTI VARIABILI'!T48","v":0},{"$f":"+'6) INPUT COSTI VARIABILI'!U48","v":0},{"$f":"+'6) INPUT COSTI VARIABILI'!V48","v":0},{"$f":"+'6) INPUT COSTI VARIABILI'!W48","v":0},{"$f":"+'6) INPUT COSTI VARIABILI'!X48","v":0},{"$f":"+'6) INPUT COSTI VARIABILI'!Y48","v":0},{"$f":"+'6) INPUT COSTI VARIABILI'!Z48","v":0},{"$f":"+'6) INPUT COSTI VARIABILI'!AA48","v":0},{"$f":"+'6) INPUT COSTI VARIABILI'!AB48","v":0},{"$f":"+'6) INPUT COSTI VARIABILI'!AC48","v":0},0,null,{"$f":"+'6) INPUT COSTI VARIABILI'!AG48","v":0},{"$f":"+'6) INPUT COSTI VARIABILI'!AH48","v":0},{"$f":"+'6) INPUT COSTI VARIABILI'!AI48","v":0},{"$f":"+'6) INPUT COSTI VARIABILI'!AJ48","v":0},{"$f":"+'6) INPUT COSTI VARIABILI'!AK48","v":0},{"$f":"+'6) INPUT COSTI VARIABILI'!AL48","v":0},{"$f":"+'6) INPUT COSTI VARIABILI'!AM48","v":0},{"$f":"+'6) INPUT COSTI VARIABILI'!AN48","v":0},{"$f":"+'6) INPUT COSTI VARIABILI'!AO48","v":0},{"$f":"+'6) INPUT COSTI VARIABILI'!AP48","v":0},{"$f":"+'6) INPUT COSTI VARIABILI'!AQ48","v":0},{"$f":"+'6) INPUT COSTI VARIABILI'!AR48","v":0},0]
["TOTALE",{"$f":"SUM(B109:B117)","v":78},{"$f":"SUM(C109:C117)","v":244.9},{"$f":"SUM(D109:D117)","v":502.2},518.94000000000005,518.94000000000005,237,80.600000000000009,78,518.94000000000005,80.600000000000009,72.800000000000011,80.600000000000009,3011.52,null,78,244.9,502.2,518.94000000000005,518.94000000000005,237,80.600000000000009,78,518.94000000000005,80.600000000000009,72.800000000000011,80.600000000000009,3011.52,null,78,244.9,502.2,518.94000000000005,518.94000000000005,237,80.600000000000009,78,518.94000000000005,80.600000000000009,72.800000000000011,80.600000000000009,3011.52]
[]
[null,{"$f":"+B108","v":"2016-04-30"},{"$f":"+C108","v":"2016-05-31"},"2016-06-30","2016-07-31","2016-08-31","2016-09-30","2016-10-31","2016-11-30","2016-12-31","2017-01-31","2017-02-28","2017-03-31","TOTALE",null,"2017-04-30","2017-05-31","2017-06-30","2017-07-31","2017-08-31","2017-09-30","2017-10-31","2017-11-30","2017-12-31","2018-01-31","2018-02-28","2018-03-31","TOTALE",null,"2018-04-30","2018-05-31","2018-06-30","2018-07-31","2018-08-31","2018-09-30","2018-10-31","2018-11-30","2018-12-31","2019-01-31","2019-02-28","2019-03-31","TOTALE"]
["IMPOSTE SUI REDDITI",{"$f":"_xlfn.IFNA(VLOOKUP(B120,'8) OUTPUT TASSAZIONE'!$B$20:$C$27,2,FALSE),0)","v":0},{"$f":"_xlfn.IFNA(VLOOKUP(C120,'8) OUTPUT TASSAZIONE'!$B$20:$C$27,2,FALSE),0)","v":0},{"$f":"_xlfn.IFNA(VLOOKUP(D120,'8) OUTPUT TASSAZIONE'!$B$20:$C$27,2,FALSE),0)","v":0},{"$f":"_xlfn.IFNA(VLOOKUP(E120,'8) OUTPUT TASSAZIONE'!$B$20:$C$27,2,FALSE),0)","v":0},{"$f":"_xlfn.IFNA(VLOOKUP(F120,'8) OUTPUT TASSAZIONE'!$B$20:$C$27,2,FALSE),0)","v":0},{"$f":"_xlfn.IFNA(VLOOKUP(G120,'8) OUTPUT TASSAZIONE'!$B$20:$C$27,2,FALSE),0)","v":0},{"$f":"_xlfn.IFNA(VLOOKUP(H120,'8) OUTPUT TASSAZIONE'!$B$20:$C$27,2,FALSE),0)","v":0},{"$f":"_xlfn.IFNA(VLOOKUP(I120,'8) OUTPUT TASSAZIONE'!$B$20:$C$27,2,FALSE),0)","v":0},{"$f":"_xlfn.IFNA(VLOOKUP(J120,'8) OUTPUT TASSAZIONE'!$B$20:$C$27,2,FALSE),0)","v":0},{"$f":"_xlfn.IFNA(VLOOKUP(K120,'8) OUTPUT TASSAZIONE'!$B$20:$C$27,2,FALSE),0)","v":0},{"$f":"_xlfn.IFNA(VLOOKUP(L120,'8) OUTPUT TASSAZIONE'!$B$20:$C$27,2,FALSE),0)","v":0},{"$f":"_xlfn.IFNA(VLOOKUP(M120,'8) OUTPUT TASSAZIONE'!$B$20:$C$27,2,FALSE),0)","v":0},{"$f":"SUM(B121:M121)","v":0},null,{"$f":"_xlfn.IFNA(VLOOKUP(P120,'8) OUTPUT TASSAZIONE'!$B$20:$C$27,2,FALSE),0)","v":0},{"$f":"_xlfn.IFNA(VLOOKUP(Q120,'8) OUTPUT TASSAZIONE'!$B$20:$C$27,2,FALSE),0)","v":0},{"$f":"_xlfn.IFNA(VLOOKUP(R120,'8) OUTPUT TASSAZIONE'!$B$20:$C$27,2,FALSE),0)","v":728.44800000000009},{"$f":"_xlfn.IFNA(VLOOKUP(S120,'8) OUTPUT TASSAZIONE'!$B$20:$C$27,2,FALSE),0)","v":0},{"$f":"_xlfn.IFNA(VLOOKUP(T120,'8) OUTPUT TASSAZIONE'!$B$20:$C$27,2,FALSE),0)","v":0},{"$f":"_xlfn.IFNA(VLOOKUP(U120,'8) OUTPUT TASSAZIONE'!$B$20:$C$27,2,FALSE),0)","v":0},{"$f":"_xlfn.IFNA(VLOOKUP(V120,'8) OUTPUT TASSAZIONE'!$B$20:$C$27,2,FALSE),0)","v":0},{"$f":"_xlfn.IFNA(VLOOKUP(W120,'8) OUTPUT TASSAZIONE'!$B$20:$C$27,2,FALSE),0)","v":312.19200000000001},{"$f":"_xlfn.IFNA(VLOOKUP(X120,'8) OUTPUT TASSAZIONE'!$B$20:$C$27,2,FALSE),0)","v":0},{"$f":"_xlfn.IFNA(VLOOKUP(Y120,'8) OUTPUT TASSAZIONE'!$B$20:$C$27,2,FALSE),0)","v":0},{"$f":"_xlfn.IFNA(VLOOKUP(Z120,'8) OUTPUT TASSAZIONE'!$B$20:$C$27,2,FALSE),0)","v":0},{"$f":"_xlfn.IFNA(VLOOKUP(AA120,'8) OUTPUT TASSAZIONE'!$B$20:$C$27,2,FALSE),0)","v":0},{"$f":"SUM(P121:AA121)","v":1040.6400000000001},null,{"$f":"_xlfn.IFNA(VLOOKUP(AD120,'8) OUTPUT TASSAZIONE'!$B$20:$C$27,2,FALSE),0)","v":0},{"$f":"_xlfn.IFNA(VLOOKUP(AE120,'8) OUTPUT TASSAZIONE'!$B$20:$C$27,2,FALSE),0)","v":0},{"$f":"_xlfn.IFNA(VLOOKUP(AF120,'8) OUTPUT TASSAZIONE'!$B$20:$C$27,2,FALSE),0)","v":50.4},{"$f":"_xlfn.IFNA(VLOOKUP(AG120,'8) OUTPUT TASSAZIONE'!$B$20:$C$27,2,FALSE),0)","v":0},{"$f":"_xlfn.IFNA(VLOOKUP(AH120,'8) OUTPUT TASSAZIONE'!$B$20:$C$27,2,FALSE),0)","v":0},{"$f":"_xlfn.IFNA(VLOOKUP(AI120,'8) OUTPUT TASSAZIONE'!$B$20:$C$27,2,FALSE),0)","v":0},{"$f":"_xlfn.IFNA(VLOOKUP(AJ120,'8) OUTPUT TASSAZIONE'!$B$20:$C$27,2,FALSE),0)","v":0},{"$f":"_xlfn.IFNA(VLOOKUP(AK120,'8) OUTPUT TASSAZIONE'!$B$20:$C$27,2,FALSE),0)","v":21.599999999999998},{"$f":"_xlfn.IFNA(VLOOKUP(AL120,'8) OUTPUT TASSAZIONE'!$B$20:$C$27,2,FALSE),0)","v":0},{"$f":"_xlfn.IFNA(VLOOKUP(AM120,'8) OUTPUT TASSAZIONE'!$B$20:$C$27,2,FALSE),0)","v":0},{"$f":"_xlfn.IFNA(VLOOKUP(AN120,'8) OUTPUT TASSAZIONE'!$B$20:$C$27,2,FALSE),0)","v":0},{"$f":"_xlfn.IFNA(VLOOKUP(AO120,'8) OUTPUT TASSAZIONE'!$B$20:$C$27,2,FALSE),0)","v":0},{"$f":"SUM(AD121:AO121)","v":72}]
[]
["UNLEVERED",{"$f":"+B120","v":"2016-04-30"},{"$f":"+C120","v":"2016-05-31"},"2016-06-30","2016-07-31","2016-08-31","2016-09-30","2016-10-31","2016-11-30","2016-12-31","2017-01-31","2017-02-28","2017-03-31","TOTALE",null,"2017-04-30","2017-05-31","2017-06-30","2017-07-31","2017-08-31","2017-09-30","2017-10-31","2017-11-30","2017-12-31","2018-01-31","2018-02-28","2018-03-31","TOTALE",null,"2018-04-30","2018-05-31","2018-06-30","2018-07-31","2018-08-31","2018-09-30","2018-10-31","2018-11-30","2018-12-31","2019-01-31","2019-02-28","2019-03-31","TOTALE"]
["CASH FLOW",{"$f":"+B17-B69-B106-B118-B121","v":0},{"$f":"+C17-C69-C106-C118-C121","v":1535.1},{"$f":"+D17-D69-D106-D118-D121","v":4127.8},4063.06,4273.0599999999995,1473,259.39999999999998,132,4273.0599999999995,99.399999999999991,257.2,{"$f":"+M17-M69-M106-M118-M121","v":-9.9475983006414026E-14},{"$f":"SUM(B124:M124)","v":20493.079999999998},null,{"$f":"+P17-P69-P106-P118-P121","v":0},{"$f":"+Q17-Q69-Q106-Q118-Q121","v":1535.1},3399.3519999999999,4063.06,4273.0599999999995,1473,259.39999999999998,0,4273.0599999999995,99.399999999999991,{"$f":"+Z17-Z69-Z106-Z118-Z121","v":257.2},-9.9475983006414026E-14,{"$f":"SUM(O124:AA124)","v":19632.632000000001},null,{"$f":"+AD17-AD69-AD106-AD118-AD121","v":0},{"$f":"+AE17-AE69-AE106-AE118-AE121","v":1535.1},4077.4,4063.06,4273.0599999999995,1473,259.39999999999998,110.4,4273.0599999999995,99.399999999999991,257.2,-9.9475983006414026E-14,{"$f":"SUM(AC124:AO124)","v":20421.079999999998}]
[]
["OPZIONE CAPITALE","SI COMPENSA FLUSSI NEGATIVI CON CAPITALE"]
["FABBISOGNO DI CAPIALE",{"$f":"+B16","v":7608},0,0,0,0,0,0,0,0,0,0,600.6,8208.6,0,8,0,0,0,0,0,0,180.19200000000001,0,0,0,600.6,788.79200000000003,0,8,0,0,0,0,0,0,0,0,0,0,600.6,608.6]
[]
["Consiglio: si consiglia inizialemtne di impostare su LEVERED e NO NON COMPENSARE FLUSSI NEGATIVI CON CAPITALE, così sarà possibile evidenziare i risultati in funzione delle ipotesi inserite nel foglio INPUT finanziamento. Successivamente si possono effettuare le altre combinazione di ipotesi, ad esempio si può verificare il capitale necessario a compensare i flussi negativi in situazione levered, oppure in assenza di capitale di terzi."]

{"sheet":"10) OUTPUT RIEPILOGO","index":9,"n_rows":136,"n_cols":42,"rows_kept":136,"cut":false,"hidden":false,"merged":[[128,0,131,13]]}
["BUSINESS PLAN PER L'EXTRALBERGHIERO"]
["DOTT. LEONE GABRIELE"]
["WWW.BNBMAKER.COM - WWW.LEONEADVISOR.IT"]
[null,{"$f":"+'3) INPUT VENDITE'!B2","v":"2016-04-30"},{"$f":"+'3) INPUT VENDITE'!C2","v":"2016-05-31"},{"$f":"+'3) INPUT VENDITE'!D2","v":"2016-06-30"},{"$f":"+'3) INPUT VENDITE'!E2","v":"2016-07-31"},{"$f":"+'3) INPUT VENDITE'!F2","v":"2016-08-31"},{"$f":"+'3) INPUT VENDITE'!G2","v":"2016-09-30"},{"$f":"+'3) INPUT VENDITE'!H2","v":"2016-10-31"},{"$f":"+'3) INPUT VENDITE'!I2","v":"2016-11-30"},{"$f":"+'3) INPUT VENDITE'!J2","v":"2016-12-31"},{"$f":"+'3) INPUT VENDITE'!K2","v":"2017-01-31"},{"$f":"+'3) INPUT VENDITE'!L2","v":"2017-02-28"},{"$f":"+'3) INPUT VENDITE'!M2","v":"2017-03-31"},{"$f":"+'3) INPUT VENDITE'!N2","v":"TOTALE"},null,{"$f":"+'3) INPUT VENDITE'!P2","v":"2017-04-30"},{"$f":"+'3) INPUT VENDITE'!Q2","v":"2017-05-31"},{"$f":"+'3) INPUT VENDITE'!R2","v":"2017-06-30"},{"$f":"+'3) INPUT VENDITE'!S2","v":"2017-07-31"},{"$f":"+'3) INPUT VENDITE'!T2","v":"2017-08-31"},{"$f":"+'3) INPUT VENDITE'!U2","v":"2017-09-30"},{"$f":"+'3) INPUT VENDITE'!V2","v":"2017-10-31"},{"$f":"+'3) INPUT VENDITE'!W2","v":"2017-11-30"},{"$f":"+'3) INPUT VENDITE'!X2","v":"2017-12-31"},{"$f":"+'3) INPUT VENDITE'!Y2","v":"2018-01-31"},{"$f":"+'3) INPUT VENDITE'!Z2","v":"2018-02-28"},{"$f":"+'3) INPUT VENDITE'!AA2","v":"2018-03-31"},{"$f":"+'3) INPUT VENDITE'!AB2","v":"TOTALE"},null,{"$f":"+'3) INPUT VENDITE'!AD2","v":"2018-04-30"},{"$f":"+'3) INPUT VENDITE'!AE2","v":"2018-05-31"},{"$f":"+'3) INPUT VENDITE'!AF2","v":"2018-06-30"},{"$f":"+'3) INPUT VENDITE'!AG2","v":"2018-07-31"},{"$f":"+'3) INPUT VENDITE'!AH2","v":"2018-08-31"},{"$f":"+'3) INPUT VENDITE'!AI2","v":"2018-09-30"},{"$f":"+'3) INPUT VENDITE'!AJ2","v":"2018-10-31"},{"$f":"+'3) INPUT VENDITE'!AK2","v":"2018-11-30"},{"$f":"+'3) INPUT VENDITE'!AL2","v":"2018-12-31"},{"$f":"+'3) INPUT VENDITE'!AM2","v":"2019-01-31"},{"$f":"+'3) INPUT VENDITE'!AN2","v":"2019-02-28"},{"$f":"+'3) INPUT VENDITE'!AO2","v":"2019-03-31"},{"$f":"+'3) INPUT VENDITE'!AP2","v":"TOTALE"}]
[{"$f":"+'3) INPUT VENDITE'!A4","v":"CAMERE QUADRUPLE"},{"$f":"+'3) INPUT VENDITE'!B4","v":0},{"$f":"+'3) INPUT VENDITE'!C4","v":0},{"$f":"+'3) INPUT VENDITE'!D4","v":0},{"$f":"+'3) INPUT VENDITE'!E4","v":0},{"$f":"+'3) INPUT VENDITE'!F4","v":0},{"$f":"+'3) INPUT VENDITE'!G4","v":0},{"$f":"+'3) INPUT VENDITE'!H4","v":0},{"$f":"+'3) INPUT VENDITE'!I4","v":0},{"$f":"+'3) INPUT VENDITE'!J4","v":0},{"$f":"+'3) INPUT VENDITE'!K4","v":0},{"$f":"+'3) INPUT VENDITE'!L4","v":0},{"$f":"+'3) INPUT VENDITE'!M4","v":0},{"$f":"SUM(B5:M5)","v":0},null,{"$f":"+'3) INPUT VENDITE'!P4","v":0},{"$f":"+'3) INPUT VENDITE'!Q4","v":0},{"$f":"+'3) INPUT VENDITE'!R4","v":0},{"$f":"+'3) INPUT VENDITE'!S4","v":0},{"$f":"+'3) INPUT VENDITE'!T4","v":0},{"$f":"+'3) INPUT VENDITE'!U4","v":0},{"$f":"+'3) INPUT VENDITE'!V4","v":0},{"$f":"+'3) INPUT VENDITE'!W4","v":0},{"$f":"+'3) INPUT VENDITE'!X4","v":0},{"$f":"+'3) INPUT VENDITE'!Y4","v":0},{"$f":"+'3) INPUT VENDITE'!Z4","v":0},{"$f":"+'3) INPUT VENDITE'!AA4","v":0},{"$f":"SUM(P5:AA5)","v":0},null,{"$f":"+'3) INPUT VENDITE'!AD4","v":0},{"$f":"+'3) INPUT VENDITE'!AE4","v":0},{"$f":"+'3) INPUT VENDITE'!AF4","v":0},{"$f":"+'3) INPUT VENDITE'!AG4","v":0},{"$f":"+'3) INPUT VENDITE'!AH4","v":0},{"$f":"+'3) INPUT VENDITE'!AI4","v":0},{"$f":"+'3) INPUT VENDITE'!AJ4","v":0},{"$f":"+'3) INPUT VENDITE'!AK4","v":0},{"$f":"+'3) INPUT VENDITE'!AL4","v":0},{"$f":"+'3) INPUT VENDITE'!AM4","v":0},{"$f":"+'3) INPUT VENDITE'!AN4","v":0},{"$f":"+'3) INPUT VENDITE'!AO4","v":0},{"$f":"SUM(AD5:AO5)","v":0}]
[{"$f":"+'3) INPUT VENDITE'!A5","v":"CAMERE TRIPLE"},{"$f":"+'3) INPUT VENDITE'!B5","v":0},{"$f":"+'3) INPUT VENDITE'!C5","v":0},{"$f":"+'3) INPUT VENDITE'!D5","v":0},{"$f":"+'3) INPUT VENDITE'!E5","v":0},{"$f":"+'3) INPUT VENDITE'!F5","v":0},{"$f":"+'3) INPUT VENDITE'!G5","v":0},{"$f":"+'3) INPUT VENDITE'!H5","v":0},{"$f":"+'3) INPUT VENDITE'!I5","v":0},{"$f":"+'3) INPUT VENDITE'!J5","v":0},{"$f":"+'3) INPUT VENDITE'!K5","v":0},{"$f":"+'3) INPUT VENDITE'!L5","v":0},{"$f":"+'3) INPUT VENDITE'!M5","v":0},0,null,{"$f":"+'3) INPUT VENDITE'!P5","v":0},{"$f":"+'3) INPUT VENDITE'!Q5","v":0},{"$f":"+'3) INPUT VENDITE'!R5","v":0},{"$f":"+'3) INPUT VENDITE'!S5","v":0},{"$f":"+'3) INPUT VENDITE'!T5","v":0},{"$f":"+'3) INPUT VENDITE'!U5","v":0},{"$f":"+'3) INPUT VENDITE'!V5","v":0},{"$f":"+'3) INPUT VENDITE'!W5","v":0},{"$f":"+'3) INPUT VENDITE'!X5","v":0},{"$f":"+'3) INPUT VENDITE'!Y5","v":0},{"$f":"+'3) INPUT VENDITE'!Z5","v":0},{"$f":"+'3) INPUT VENDITE'!AA5","v":0},{"$f":"SUM(P6:AA6)","v":0},null,{"$f":"+'3) INPUT VENDITE'!AD5","v":0},{"$f":"+'3) INPUT VENDITE'!AE5","v":0},{"$f":"+'3) INPUT VENDITE'!AF5","v":0},{"$f":"+'3) INPUT VENDITE'!AG5","v":0},{"$f":"+'3) INPUT VENDITE'!AH5","v":0},{"$f":"+'3) INPUT VENDITE'!AI5","v":0},{"$f":"+'3) INPUT VENDITE'!AJ5","v":0},{"$f":"+'3) INPUT VENDITE'!AK5","v":0},{"$f":"+'3) INPUT VENDITE'!AL5","v":0},{"$f":"+'3) INPUT VENDITE'!AM5","v":0},{"$f":"+'3) INPUT VENDITE'!AN5","v":0},{"$f":"+'3) INPUT VENDITE'!AO5","v":0},{"$f":"SUM(AD6:AO6)","v":0}]
[{"$f":"+'3) INPUT VENDITE'!A6","v":"CAMERE DOPPIE"},{"$f":"+'3) INPUT VENDITE'!B6","v":600},{"$f":"+'3) INPUT VENDITE'!C6","v":2170},{"$f":"+'3) INPUT VENDITE'!D6","v":4860},{"$f":"+'3) INPUT VENDITE'!E6","v":5022},{"$f":"+'3) INPUT VENDITE'!F6","v":5022},{"$f":"+'3) INPUT VENDITE'!G6","v":2100},{"$f":"+'3) INPUT VENDITE'!H6","v":620},{"$f":"+'3) INPUT VENDITE'!I6","v":600},{"$f":"+'3) INPUT VENDITE'!J6","v":5022},{"$f":"+'3) INPUT VENDITE'!K6","v":620},{"$f":"+'3) INPUT VENDITE'!L6","v":560},{"$f":"+'3) INPUT VENDITE'!M6","v":620},27816,null,{"$f":"+'3) INPUT VENDITE'!P6","v":600},{"$f":"+'3) INPUT VENDITE'!Q6","v":2170},{"$f":"+'3) INPUT VENDITE'!R6","v":4860},{"$f":"+'3) INPUT VENDITE'!S6","v":5022},{"$f":"+'3) INPUT VENDITE'!T6","v":5022},{"$f":"+'3) INPUT VENDITE'!U6","v":2100},{"$f":"+'3) INPUT VENDITE'!V6","v":620},{"$f":"+'3) INPUT VENDITE'!W6","v":600},{"$f":"+'3) INPUT VENDITE'!X6","v":5022},{"$f":"+'3) INPUT VENDITE'!Y6","v":620},{"$f":"+'3) INPUT VENDITE'!Z6","v":560},{"$f":"+'3) INPUT VENDITE'!AA6","v":620},27816,null,{"$f":"+'3) INPUT VENDITE'!AD6","v":600},{"$f":"+'3) INPUT VENDITE'!AE6","v":2170},{"$f":"+'3) INPUT VENDITE'!AF6","v":4860},{"$f":"+'3) INPUT VENDITE'!AG6","v":5022},{"$f":"+'3) INPUT VENDITE'!AH6","v":5022},{"$f":"+'3) INPUT VENDITE'!AI6","v":2100},{"$f":"+'3) INPUT VENDITE'!AJ6","v":620},{"$f":"+'3) INPUT VENDITE'!AK6","v":600},{"$f":"+'3) INPUT VENDITE'!AL6","v":5022},{"$f":"+'3) INPUT VENDITE'!AM6","v":620},{"$f":"+'3) INPUT VENDITE'!AN6","v":560},{"$f":"+'3) INPUT VENDITE'!AO6","v":620},27816]
[{"$f":"+'3) INPUT VENDITE'!A7","v":"CAMERE SINGOLE"},{"$f":"+'3) INPUT VENDITE'!B7","v":0},{"$f":"+'3) INPUT VENDITE'!C7","v":0},{"$f":"+'3) INPUT VENDITE'!D7","v":0},{"$f":"+'3) INPUT VENDITE'!E7","v":0},{"$f":"+'3) INPUT VENDITE'!F7","v":0},{"$f":"+'3) INPUT VENDITE'!G7","v":0},{"$f":"+'3) INPUT VENDITE'!H7","v":0},{"$f":"+'3) INPUT VENDITE'!I7","v":0},{"$f":"+'3) INPUT VENDITE'!J7","v":0},{"$f":"+'3) INPUT VENDITE'!K7","v":0},{"$f":"+'3) INPUT VENDITE'!L7","v":0},{"$f":"+'3) INPUT VENDITE'!M7","v":0},0,null,{"$f":"+'3) INPUT VENDITE'!P7","v":0},{"$f":"+'3) INPUT VENDITE'!Q7","v":0},{"$f":"+'3) INPUT VENDITE'!R7","v":0},{"$f":"+'3) INPUT VENDITE'!S7","v":0},{"$f":"+'3) INPUT VENDITE'!T7","v":0},{"$f":"+'3) INPUT VENDITE'!U7","v":0},{"$f":"+'3) INPUT VENDITE'!V7","v":0},{"$f":"+'3) INPUT VENDITE'!W7","v":0},{"$f":"+'3) INPUT VENDITE'!X7","v":0},{"$f":"+'3) INPUT VENDITE'!Y7","v":0},{"$f":"+'3) INPUT VENDITE'!Z7","v":0},{"$f":"+'3) INPUT VENDITE'!AA7","v":0},0,null,{"$f":"+'3) INPUT VENDITE'!AD7","v":0},{"$f":"+'3) INPUT VENDITE'!AE7","v":0},{"$f":"+'3) INPUT VENDITE'!AF7","v":0},{"$f":"+'3) INPUT VENDITE'!AG7","v":0},{"$f":"+'3) INPUT VENDITE'!AH7","v":0},{"$f":"+'3) INPUT VENDITE'!AI7","v":0},{"$f":"+'3) INPUT VENDITE'!AJ7","v":0},{"$f":"+'3) INPUT VENDITE'!AK7","v":0},{"$f":"+'3) INPUT VENDITE'!AL7","v":0},{"$f":"+'3) INPUT VENDITE'!AM7","v":0},{"$f":"+'3) INPUT VENDITE'!AN7","v":0},{"$f":"+'3) INPUT VENDITE'!AO7","v":0},0]
[{"$f":"+'3) INPUT VENDITE'!A8","v":"VISITE GUIDATE"},{"$f":"+'3) INPUT VENDITE'!B8","v":0},{"$f":"+'3) INPUT VENDITE'!C8","v":0},{"$f":"+'3) INPUT VENDITE'!D8","v":0},{"$f":"+'3) INPUT VENDITE'!E8","v":0},{"$f":"+'3) INPUT VENDITE'!F8","v":0},{"$f":"+'3) INPUT VENDITE'!G8","v":0},{"$f":"+'3) INPUT VENDITE'!H8","v":0},{"$f":"+'3) INPUT VENDITE'!I8","v":0},{"$f":"+'3) INPUT VENDITE'!J8","v":0},{"$f":"+'3) INPUT VENDITE'!K8","v":0},{"$f":"+'3) INPUT VENDITE'!L8","v":0},{"$f":"+'3) INPUT VENDITE'!M8","v":0},0,null,{"$f":"+'3) INPUT VENDITE'!P8","v":0},{"$f":"+'3) INPUT VENDITE'!Q8","v":0},{"$f":"+'3) INPUT VENDITE'!R8","v":0},{"$f":"+'3) INPUT VENDITE'!S8","v":0},{"$f":"+'3) INPUT VENDITE'!T8","v":0},{"$f":"+'3) INPUT VENDITE'!U8","v":0},{"$f":"+'3) INPUT VENDITE'!V8","v":0},{"$f":"+'3) INPUT VENDITE'!W8","v":0},{"$f":"+'3) INPUT VENDITE'!X8","v":0},{"$f":"+'3) INPUT VENDITE'!Y8","v":0},{"$f":"+'3) INPUT VENDITE'!Z8","v":0},{"$f":"+'3) INPUT VENDITE'!AA8","v":0},0,null,{"$f":"+'3) INPUT VENDITE'!AD8","v":0},{"$f":"+'3) INPUT VENDITE'!AE8","v":0},{"$f":"+'3) INPUT VENDITE'!AF8","v":0},{"$f":"+'3) INPUT VENDITE'!AG8","v":0},{"$f":"+'3) INPUT VENDITE'!AH8","v":0},{"$f":"+'3) INPUT VENDITE'!AI8","v":0},{"$f":"+'3) INPUT VENDITE'!AJ8","v":0},{"$f":"+'3) INPUT VENDITE'!AK8","v":0},{"$f":"+'3) INPUT VENDITE'!AL8","v":0},{"$f":"+'3) INPUT VENDITE'!AM8","v":0},{"$f":"+'3) INPUT VENDITE'!AN8","v":0},{"$f":"+'3) INPUT VENDITE'!AO8","v":0},0]
[{"$f":"+'3) INPUT VENDITE'!A9","v":"Altri ricavi"},{"$f":"+'3) INPUT VENDITE'!B9","v":0},{"$f":"+'3) INPUT VENDITE'!C9","v":0},{"$f":"+'3) INPUT VENDITE'!D9","v":0},{"$f":"+'3) INPUT VENDITE'!E9","v":0},{"$f":"+'3) INPUT VENDITE'!F9","v":0},{"$f":"+'3) INPUT VENDITE'!G9","v":0},{"$f":"+'3) INPUT VENDITE'!H9","v":0},{"$f":"+'3) INPUT VENDITE'!I9","v":0},{"$f":"+'3) INPUT VENDITE'!J9","v":0},{"$f":"+'3) INPUT VENDITE'!K9","v":0},{"$f":"+'3) INPUT VENDITE'!L9","v":0},{"$f":"+'3) INPUT VENDITE'!M9","v":0},0,null,{"$f":"+'3) INPUT VENDITE'!P9","v":0},{"$f":"+'3) INPUT VENDITE'!Q9","v":0},{"$f":"+'3) INPUT VENDITE'!R9","v":0},{"$f":"+'3) INPUT VENDITE'!S9","v":0},{"$f":"+'3) INPUT VENDITE'!T9","v":0},{"$f":"+'3) INPUT VENDITE'!U9","v":0},{"$f":"+'3) INPUT VENDITE'!V9","v":0},{"$f":"+'3) INPUT VENDITE'!W9","v":0},{"$f":"+'3) INPUT VENDITE'!X9","v":0},{"$f":"+'3) INPUT VENDITE'!Y9","v":0},{"$f":"+'3) INPUT VENDITE'!Z9","v":0},{"$f":"+'3) INPUT VENDITE'!AA9","v":0},0,null,{"$f":"+'3) INPUT VENDITE'!AD9","v":0},{"$f":"+'3) INPUT VENDITE'!AE9","v":0},{"$f":"+'3) INPUT VENDITE'!AF9","v":0},{"$f":"+'3) INPUT VENDITE'!AG9","v":0},{"$f":"+'3) INPUT VENDITE'!AH9","v":0},{"$f":"+'3) INPUT VENDITE'!AI9","v":0},{"$f":"+'3) INPUT VENDITE'!AJ9","v":0},{"$f":"+'3) INPUT VENDITE'!AK9","v":0},{"$f":"+'3) INPUT VENDITE'!AL9","v":0},{"$f":"+'3) INPUT VENDITE'!AM9","v":0},{"$f":"+'3) INPUT VENDITE'!AN9","v":0},{"$f":"+'3) INPUT VENDITE'!AO9","v":0},0]
[{"$f":"+'3) INPUT VENDITE'!A10","v":"Altri ricavi"},{"$f":"+'3) INPUT VENDITE'!B10","v":0},{"$f":"+'3) INPUT VENDITE'!C10","v":0},{"$f":"+'3) INPUT VENDITE'!D10","v":0},{"$f":"+'3) INPUT VENDITE'!E10","v":0},{"$f":"+'3) INPUT VENDITE'!F10","v":0},{"$f":"+'3) INPUT VENDITE'!G10","v":0},{"$f":"+'3) INPUT VENDITE'!H10","v":0},{"$f":"+'3) INPUT VENDITE'!I10","v":0},{"$f":"+'3) INPUT VENDITE'!J10","v":0},{"$f":"+'3) INPUT VENDITE'!K10","v":0},{"$f":"+'3) INPUT VENDITE'!L10","v":0},{"$f":"+'3) INPUT VENDITE'!M10","v":0},0,null,{"$f":"+'3) INPUT VENDITE'!P10","v":0},{"$f":"+'3) INPUT VENDITE'!Q10","v":0},{"$f":"+'3) INPUT VENDITE'!R10","v":0},{"$f":"+'3) INPUT VENDITE'!S10","v":0},{"$f":"+'3) INPUT VENDITE'!T10","v":0},{"$f":"+'3) INPUT VENDITE'!U10","v":0},{"$f":"+'3) INPUT VENDITE'!V10","v":0},{"$f":"+'3) INPUT VENDITE'!W10","v":0},{"$f":"+'3) INPUT VENDITE'!X10","v":0},{"$f":"+'3) INPUT VENDITE'!Y10","v":0},{"$f":"+'3) INPUT VENDITE'!Z10","v":0},{"$f":"+'3) INPUT VENDITE'!AA10","v":0},0,null,{"$f":"+'3) INPUT VENDITE'!AD10","v":0},{"$f":"+'3) INPUT VENDITE'!AE10","v":0},{"$f":"+'3) INPUT VENDITE'!AF10","v":0},{"$f":"+'3) INPUT VENDITE'!AG10","v":0},{"$f":"+'3) INPUT VENDITE'!AH10","v":0},{"$f":"+'3) INPUT VENDITE'!AI10","v":0},{"$f":"+'3) INPUT VENDITE'!AJ10","v":0},{"$f":"+'3) INPUT VENDITE'!AK10","v":0},{"$f":"+'3) INPUT VENDITE'!AL10","v":0},{"$f":"+'3) INPUT VENDITE'!AM10","v":0},{"$f":"+'3) INPUT VENDITE'!AN10","v":0},{"$f":"+'3) INPUT VENDITE'!AO10","v":0},0]
[{"$f":"+'3) INPUT VENDITE'!A11","v":"Altri ricavi"},{"$f":"+'3) INPUT VENDITE'!B11","v":0},{"$f":"+'3) INPUT VENDITE'!C11","v":0},{"$f":"+'3) INPUT VENDITE'!D11","v":0},{"$f":"+'3) INPUT VENDITE'!E11","v":0},{"$f":"+'3) INPUT VENDITE'!F11","v":0},{"$f":"+'3) INPUT VENDITE'!G11","v":0},{"$f":"+'3) INPUT VENDITE'!H11","v":0},{"$f":"+'3) INPUT VENDITE'!I11","v":0},{"$f":"+'3) INPUT VENDITE'!J11","v":0},{"$f":"+'3) INPUT VENDITE'!K11","v":0},{"$f":"+'3) INPUT VENDITE'!L11","v":0},{"$f":"+'3) INPUT VENDITE'!M11","v":0},0,null,{"$f":"+'3) INPUT VENDITE'!P11","v":0},{"$f":"+'3) INPUT VENDITE'!Q11","v":0},{"$f":"+'3) INPUT VENDITE'!R11","v":0},{"$f":"+'3) INPUT VENDITE'!S11","v":0},{"$f":"+'3) INPUT VENDITE'!T11","v":0},{"$f":"+'3) INPUT VENDITE'!U11","v":0},{"$f":"+'3) INPUT VENDITE'!V11","v":0},{"$f":"+'3) INPUT VENDITE'!W11","v":0},{"$f":"+'3) INPUT VENDITE'!X11","v":0},{"$f":"+'3) INPUT VENDITE'!Y11","v":0},{"$f":"+'3) INPUT VENDITE'!Z11","v":0},{"$f":"+'3) INPUT VENDITE'!AA11","v":0},0,null,{"$f":"+'3) INPUT VENDITE'!AD11","v":0},{"$f":"+'3) INPUT VENDITE'!AE11","v":0},{"$f":"+'3) INPUT VENDITE'!AF11","v":0},{"$f":"+'3) INPUT VENDITE'!AG11","v":0},{"$f":"+'3) INPUT VENDITE'!AH11","v":0},{"$f":"+'3) INPUT VENDITE'!AI11","v":0},{"$f":"+'3) INPUT VENDITE'!AJ11","v":0},{"$f":"+'3) INPUT VENDITE'!AK11","v":0},{"$f":"+'3) INPUT VENDITE'!AL11","v":0},{"$f":"+'3) INPUT VENDITE'!AM11","v":0},{"$f":"+'3) INPUT VENDITE'!AN11","v":0},{"$f":"+'3) INPUT VENDITE'!AO11","v":0},0]
[{"$f":"+'3) INPUT VENDITE'!A12","v":"Altri ricavi"},{"$f":"+'3) INPUT VENDITE'!B12","v":0},{"$f":"+'3) INPUT VENDITE'!C12","v":0},{"$f":"+'3) INPUT VENDITE'!D12","v":0},{"$f":"+'3) INPUT VENDITE'!E12","v":0},{"$f":"+'3) INPUT VENDITE'!F12","v":0},{"$f":"+'3) INPUT VENDITE'!G12","v":0},{"$f":"+'3) INPUT VENDITE'!H12","v":0},{"$f":"+'3) INPUT VENDITE'!I12","v":0},{"$f":"+'3) INPUT VENDITE'!J12","v":0},{"$f":"+'3) INPUT VENDITE'!K12","v":0},{"$f":"+'3) INPUT VENDITE'!L12","v":0},{"$f":"+'3) INPUT VENDITE'!M12","v":0},0,null,{"$f":"+'3) INPUT VENDITE'!P12","v":0},{"$f":"+'3) INPUT VENDITE'!Q12","v":0},{"$f":"+'3) INPUT VENDITE'!R12","v":0},{"$f":"+'3) INPUT VENDITE'!S12","v":0},{"$f":"+'3) INPUT VENDITE'!T12","v":0},{"$f":"+'3) INPUT VENDITE'!U12","v":0},{"$f":"+'3) INPUT VENDITE'!V12","v":0},{"$f":"+'3) INPUT VENDITE'!W12","v":0},{"$f":"+'3) INPUT VENDITE'!X12","v":0},{"$f":"+'3) INPUT VENDITE'!Y12","v":0},{"$f":"+'3) INPUT VENDITE'!Z12","v":0},{"$f":"+'3) INPUT VENDITE'!AA12","v":0},0,null,{"$f":"+'3) INPUT VENDITE'!AD12","v":0},{"$f":"+'3) INPUT VENDITE'!AE12","v":0},{"$f":"+'3) INPUT VENDITE'!AF12","v":0},{"$f":"+'3) INPUT VENDITE'!AG12","v":0},{"$f":"+'3) INPUT VENDITE'!AH12","v":0},{"$f":"+'3) INPUT VENDITE'!AI12","v":0},{"$f":"+'3) INPUT VENDITE'!AJ12","v":0},{"$f":"+'3) INPUT VENDITE'!AK12","v":0},{"$f":"+'3) INPUT VENDITE'!AL12","v":0},{"$f":"+'3) INPUT VENDITE'!AM12","v":0},{"$f":"+'3) INPUT VENDITE'!AN12","v":0},{"$f":"+'3) INPUT VENDITE'!AO12","v":0},0]
[{"$f":"+'3) INPUT VENDITE'!A13","v":"Altri ricavi"},{"$f":"+'3) INPUT VENDITE'!B13","v":0},{"$f":"+'3) INPUT VENDITE'!C13","v":0},{"$f":"+'3) INPUT VENDITE'!D13","v":0},{"$f":"+'3) INPUT VENDITE'!E13","v":0},{"$f":"+'3) INPUT VENDITE'!F13","v":0},{"$f":"+'3) INPUT VENDITE'!G13","v":0},{"$f":"+'3) INPUT VENDITE'!H13","v":0},{"$f":"+'3) INPUT VENDITE'!I13","v":0},{"$f":"+'3) INPUT VENDITE'!J13","v":0},{"$f":"+'3) INPUT VENDITE'!K13","v":0},{"$f":"+'3) INPUT VENDITE'!L13","v":0},{"$f":"+'3) INPUT VENDITE'!M13","v":0},0,null,{"$f":"+'3) INPUT VENDITE'!P13","v":0},{"$f":"+'3) INPUT VENDITE'!Q13","v":0},{"$f":"+'3) INPUT VENDITE'!R13","v":0},{"$f":"+'3) INPUT VENDITE'!S13","v":0},{"$f":"+'3) INPUT VENDITE'!T13","v":0},{"$f":"+'3) INPUT VENDITE'!U13","v":0},{"$f":"+'3) INPUT VENDITE'!V13","v":0},{"$f":"+'3) INPUT VENDITE'!W13","v":0},{"$f":"+'3) INPUT VENDITE'!X13","v":0},{"$f":"+'3) INPUT VENDITE'!Y13","v":0},{"$f":"+'3) INPUT VENDITE'!Z13","v":0},{"$f":"+'3) INPUT VENDITE'!AA13","v":0},0,null,{"$f":"+'3) INPUT VENDITE'!AD13","v":0},{"$f":"+'3) INPUT VENDITE'!AE13","v":0},{"$f":"+'3) INPUT VENDITE'!AF13","v":0},{"$f":"+'3) INPUT VENDITE'!AG13","v":0},{"$f":"+'3) INPUT VENDITE'!AH13","v":0},{"$f":"+'3) INPUT VENDITE'!AI13","v":0},{"$f":"+'3) INPUT VENDITE'!AJ13","v":0},{"$f":"+'3) INPUT VENDITE'!AK13","v":0},{"$f":"+'3) INPUT VENDITE'!AL13","v":0},{"$f":"+'3) INPUT VENDITE'!AM13","v":0},{"$f":"+'3) INPUT VENDITE'!AN13","v":0},{"$f":"+'3) INPUT VENDITE'!AO13","v":0},0]
["EROGAZIONE FINANZIAMENTO",{"$f":"IF(A123=\"LEVERED\",'7) INPUT FINANZIAMENTO'!B11,0)","v":0},null,null,null,null,null,null,null,null,null,null,null,0,null,null,null,null,null,null,null,null,null,null,null,null,null,0,null,null,null,null,null,null,null,null,null,null,null,null,null,0]
["VERSAMENTO CAPITALE",{"$f":"IF($B$126=\"SI COMPENSA FLUSSI NEGATIVI CON CAPITALE\",IF(SUM(B5:B15)-B69-B106-B118-B121<0,-(SUM(B5:B15)-B69-B106-B118-B121),0),'7) INPUT FINANZIAMENTO'!B10)","v":7608},{"$f":"IF($B$126=\"SI COMPENSA FLUSSI NEGATIVI CON CAPITALE\",IF(SUM(C5:C15)-C69-C106-C118-C121<0,-(SUM(C5:C15)-C69-C106-C118-C121),0),0)","v":0},0,0,0,0,0,0,0,0,0,600.6,8208.6,{"$f":"IF($B$126=\"SI COMPENSA FLUSSI NEGATIVI CON CAPITALE\",IF(SUM(O5:O15)-O69-O106-O118-O121<0,-(SUM(O5:O15)-O69-O106-O118-O121),0),0)","v":0},8,0,0,0,0,0,0,180.19200000000001,0,0,0,600.6,788.79200000000003,{"$f":"IF($B$126=\"SI COMPENSA FLUSSI NEGATIVI CON CAPITALE\",IF(SUM(AC5:AC15)-AC69-AC106-AC118-AC121<0,-(SUM(AC5:AC15)-AC69-AC106-AC118-AC121),0),0)","v":0},8,0,0,0,0,0,0,0,0,0,0,600.6,608.6]
["ENTRATE",{"$f":"SUM(B5:B16)","v":8208},{"$f":"SUM(C5:C16)","v":2170},{"$f":"SUM(D5:D16)","v":4860},5022,5022,2100,620,600,5022,620,560,1220.5999999999999,{"$f":"SUM(B17:M17)","v":36024.6},null,{"$f":"SUM(P5:P16)","v":608},{"$f":"SUM(Q5:Q16)","v":2170},4860,5022,5022,2100,620,780.19200000000001,5022,620,560,1220.5999999999999,{"$f":"SUM(P17:AA17)","v":28604.791999999998},null,{"$f":"SUM(AD5:AD16)","v":608},{"$f":"SUM(AE5:AE16)","v":2170},4860,5022,5022,2100,620,600,5022,620,560,1220.5999999999999,{"$f":"SUM(AD17:AO17)","v":28424.6}]
[]
[null,{"$f":"+B4","v":"2016-04-30"},"2016-05-31","2016-06-30","2016-07-31","2016-08-31","2016-09-30","2016-10-31","2016-11-30","2016-12-31","2017-01-31","2017-02-28","2017-03-31","TOTALE",null,{"$f":"+P4","v":"2017-04-30"},"2017-05-31","2017-06-30","2017-07-31","2017-08-31","2017-09-30","2017-10-31","2017-11-30","2017-12-31","2018-01-31","2018-02-28","2018-03-31","TOTALE",null,{"$f":"+AD4","v":"2018-04-30"},"2018-05-31","2018-06-30","2018-07-31","2018-08-31","2018-09-30","2018-10-31","2018-11-30","2018-12-31","2019-01-31","2019-02-28","2019-03-31","TOTALE"]
[{"$f":"+'2) INPUT INVESTIMENTI'!A9","v":"Costi di costituzione"},{"$f":"+'2) INPUT INVESTIMENTI'!D9","v":500},null,null,null,null,null,null,null,null,null,null,null,{"$f":"SUM(B20:M20)","v":500}]
[{"$f":"+'2) INPUT INVESTIMENTI'!A10","v":"Sito internet"},{"$f":"+'2) INPUT INVESTIMENTI'!D10","v":600},null,null,null,null,null,null,null,null,null,null,null,{"$f":"SUM(B21:M21)","v":600}]
[{"$f":"+'2) INPUT INVESTIMENTI'!A11","v":"Elaborazione business plan"},{"$f":"+'2) INPUT INVESTIMENTI'!D11","v":0},null,null,null,null,null,null,null,null,null,null,null,0]
[{"$f":"+'2) INPUT INVESTIMENTI'!A12","v":"Promozione pre avvio"},{"$f":"+'2) INPUT INVESTIMENTI'!D12","v":1000},null,null,null,null,null,null,null,null,null,null,null,1000]
[{"$f":"+'2) INPUT INVESTIMENTI'!A13","v":"Altri investimenti immateriali"},{"$f":"+'2) INPUT INVESTIMENTI'!D13","v":0},null,null,null,null,null,null,null,null,null,null,null,0]
[{"$f":"+'2) INPUT INVESTIMENTI'!A14","v":"Altri investimenti immateriali"},{"$f":"+'2) INPUT INVESTIMENTI'!D14","v":0},null,null,null,null,null,null,null,null,null,null,null,0]
[{"$f":"+'2) INPUT INVESTIMENTI'!A15","v":"Altri investimenti immateriali"},{"$f":"+'2) INPUT INVESTIMENTI'!D15","v":0},null,null,null,null,null,null,null,null,null,null,null,0]
[{"$f":"+'2) INPUT INVESTIMENTI'!A16","v":"Altri investimenti immateriali"},{"$f":"+'2) INPUT INVESTIMENTI'!D16","v":0},null,null,null,null,null,null,null,null,null,null,null,0]
[{"$f":"+'2) INPUT INVESTIMENTI'!A17","v":"Altri investimenti immateriali"},{"$f":"+'2) INPUT INVESTIMENTI'!D17","v":0},null,null,null,null,null,null,null,null,null,null,null,0]
[{"$f":"+'2) INPUT INVESTIMENTI'!A18","v":"Altri investimenti immateriali"},{"$f":"+'2) INPUT INVESTIMENTI'!D18","v":0},null,null,null,null,null,null,null,null,null,null,null,0]
[{"$f":"+'2) INPUT INVESTIMENTI'!A19","v":"Altri investimenti immateriali"},{"$f":"+'2) INPUT INVESTIMENTI'!D19","v":0},null,null,null,null,null,null,null,null,null,null,null,0]
["INVESTIMENTI MATERIALI"]
[{"$f":"+'2) INPUT INVESTIMENTI'!A21","v":"Insegne/targhe"},{"$f":"+'2) INPUT INVESTIMENTI'!D21","v":150},null,null,null,null,null,null,null,null,null,null,null,150]
[{"$f":"+'2) INPUT INVESTIMENTI'!A22","v":"Ristrutturazioni"},{"$f":"+'2) INPUT INVESTIMENTI'!D22","v":0},null,null,null,null,null,null,null,null,null,null,null,0]
[{"$f":"+'2) INPUT INVESTIMENTI'!A23","v":"Impianto climatizzazione"},{"$f":"+'2) INPUT INVESTIMENTI'!D23","v":2000},null,null,null,null,null,null,null,null,null,null,null,2000]
[{"$f":"+'2) INPUT INVESTIMENTI'!A24","v":"Impianto riscaldamenti"},{"$f":"+'2) INPUT INVESTIMENTI'!D24","v":0},null,null,null,null,null,null,null,null,null,null,null,0]
[{"$f":"+'2) INPUT INVESTIMENTI'!A25","v":"Arredo camere"},{"$f":"+'2) INPUT INVESTIMENTI'!D25","v":2000},null,null,null,null,null,null,null,null,null,null,null,2000]
[{"$f":"+'2) INPUT INVESTIMENTI'!A26","v":"Arredo salotto"},{"$f":"+'2) INPUT INVESTIMENTI'!D26","v":0},null,null,null,null,null,null,null,null,null,null,null,0]
[{"$f":"+'2) INPUT INVESTIMENTI'!A27","v":"Arredo cortile/area esterna"},{"$f":"+'2) INPUT INVESTIMENTI'!D27","v":0},null,null,null,null,null,null,null,null,null,null,null,0]
[{"$f":"+'2) INPUT INVESTIMENTI'!A28","v":"Arredo cucina"},{"$f":"+'2) INPUT INVESTIMENTI'!D28","v":0},null,null,null,null,null,null,null,null,null,null,null,0]
[{"$f":"+'2) INPUT INVESTIMENTI'!A29","v":"Arredo servizi igienici"},{"$f":"+'2) INPUT INVESTIMENTI'!D29","v":0},null,null,null,null,null,null,null,null,null,null,null,0]
[{"$f":"+'2) INPUT INVESTIMENTI'!A30","v":"Arredo ufficio/stanza titolare"},{"$f":"+'2) INPUT INVESTIMENTI'!D30","v":0},null,null,null,null,null,null,null,null,null,null,null,0]
[{"$f":"+'2) INPUT INVESTIMENTI'!A31","v":"Altro arredo locale"},{"$f":"+'2) INPUT INVESTIMENTI'!D31","v":0},null,null,null,null,null,null,null,null,null,null,null,0]
[{"$f":"+'2) INPUT INVESTIMENTI'!A32","v":"Cucina"},{"$f":"+'2) INPUT INVESTIMENTI'!D32","v":0},null,null,null,null,null,null,null,null,null,null,null,0]
[{"$f":"+'2) INPUT INVESTIMENTI'!A33","v":"Mobili cucina"},{"$f":"+'2) INPUT INVESTIMENTI'!D33","v":0},null,null,null,null,null,null,null,null,null,null,null,0]
[{"$f":"+'2) INPUT INVESTIMENTI'!A34","v":"Mobili cucina"},{"$f":"+'2) INPUT INVESTIMENTI'!D34","v":0},null,null,null,null,null,null,null,null,null,null,null,0]
[{"$f":"+'2) INPUT INVESTIMENTI'!A35","v":"Frigorifero"},{"$f":"+'2) INPUT INVESTIMENTI'!D35","v":0},null,null,null,null,null,null,null,null,null,null,null,0]
[{"$f":"+'2) INPUT INVESTIMENTI'!A36","v":"Altri elettrodomestici"},{"$f":"+'2) INPUT INVESTIMENTI'!D36","v":0},null,null,null,null,null,null,null,null,null,null,null,0]
[{"$f":"+'2) INPUT INVESTIMENTI'!A37","v":"Altri elettrodomestici"},{"$f":"+'2) INPUT INVESTIMENTI'!D37","v":0},null,null,null,null,null,null,null,null,null,null,null,0]
[{"$f":"+'2) INPUT INVESTIMENTI'!A38","v":"Altri elettrodomestici"},{"$f":"+'2) INPUT INVESTIMENTI'!D38","v":0},null,null,null,null,null,null,null,null,null,null,null,0]
[{"$f":"+'2) INPUT INVESTIMENTI'!A39","v":"Altri elettrodomestici"},{"$f":"+'2) INPUT INVESTIMENTI'!D39","v":0},null,null,null,null,null,null,null,null,null,null,null,0]
[{"$f":"+'2) INPUT INVESTIMENTI'!A40","v":"Utensili/Attrezzatura cucina"},{"$f":"+'2) INPUT INVESTIMENTI'!D40","v":100},null,null,null,null,null,null,null,null,null,null,null,100]
[{"$f":"+'2) INPUT INVESTIMENTI'!A41","v":"Biancheria per la casa"},{"$f":"+'2) INPUT INVESTIMENTI'!D41","v":500},null,null,null,null,null,null,null,null,null,null,null,500]
[{"$f":"+'2) INPUT INVESTIMENTI'!A42","v":"Strumenti per pulizia locali"},{"$f":"+'2) INPUT INVESTIMENTI'!D42","v":0},null,null,null,null,null,null,null,null,null,null,null,0]
[{"$f":"+'2) INPUT INVESTIMENTI'!A43","v":"Telefono fisso"},{"$f":"+'2) INPUT INVESTIMENTI'!D43","v":0},null,null,null,null,null,null,null,null,null,null,null,0]
[{"$f":"+'2) INPUT INVESTIMENTI'!A44","v":"Telefoni cellulari "},{"$f":"+'2) INPUT INVESTIMENTI'!D44","v":0},null,null,null,null,null,null,null,null,null,null,null,0]
[{"$f":"+'2) INPUT INVESTIMENTI'!A45","v":"Segreteria telefonica"},{"$f":"+'2) INPUT INVESTIMENTI'!D45","v":50},null,null,null,null,null,null,null,null,null,null,null,50]
[{"$f":"+'2) INPUT INVESTIMENTI'!A46","v":"Fax"},{"$f":"+'2) INPUT INVESTIMENTI'!D46","v":0},null,null,null,null,null,null,null,null,null,null,null,0]
[{"$f":"+'2) INPUT INVESTIMENTI'!A47","v":"Computer"},{"$f":"+'2) INPUT INVESTIMENTI'!D47","v":500},null,null,null,null,null,null,null,null,null,null,null,500]
[{"$f":"+'2) INPUT INVESTIMENTI'!A48","v":"Software"},{"$f":"+'2) INPUT INVESTIMENTI'!D48","v":100},null,null,null,null,null,null,null,null,null,null,null,100]
[{"$f":"+'2) INPUT INVESTIMENTI'!A49","v":"Stampante"},{"$f":"+'2) INPUT INVESTIMENTI'!D49","v":100},null,null,null,null,null,null,null,null,null,null,null,100]
[{"$f":"+'2) INPUT INVESTIMENTI'!A50","v":"Altre attrezzature"},{"$f":"+'2) INPUT INVESTIMENTI'!D50","v":0},null,null,null,null,null,null,null,null,null,null,null,0]
[{"$f":"+'2) INPUT INVESTIMENTI'!A51","v":"Altre attrezzature"},{"$f":"+'2) INPUT INVESTIMENTI'!D51","v":0},null,null,null,null,null,null,null,null,null,null,null,0]
[{"$f":"+'2) INPUT INVESTIMENTI'!A52","v":"Altre attrezzature"},{"$f":"+'2) INPUT INVESTIMENTI'!D52","v":0},null,null,null,null,null,null,null,null,null,null,null,0]
[{"$f":"+'2) INPUT INVESTIMENTI'!A53","v":"Altri investimenti materiali"},{"$f":"+'2) INPUT INVESTIMENTI'!D53","v":0},null,null,null,null,null,null,null,null,null,null,null,0]
[{"$f":"+'2) INPUT INVESTIMENTI'!A54","v":"Altri investimenti materiali"},{"$f":"+'2) INPUT INVESTIMENTI'!D54","v":0},null,null,null,null,null,null,null,null,null,null,null,0]
[{"$f":"+'2) INPUT INVESTIMENTI'!A55","v":"Altri investimenti materiali"},{"$f":"+'2) INPUT INVESTIMENTI'!D55","v":0},null,null,null,null,null,null,null,null,null,null,null,0]
[{"$f":"+'2) INPUT INVESTIMENTI'!A56","v":"Altri investimenti materiali"},{"$f":"+'2) INPUT INVESTIMENTI'!D56","v":0},null,null,null,null,null,null,null,null,null,null,null,0]
[{"$f":"+'2) INPUT INVESTIMENTI'!A57","v":"Altri investimenti materiali"},{"$f":"+'2) INPUT INVESTIMENTI'!D57","v":0},null,null,null,null,null,null,null,null,null,null,null,0]
["INVESTIMENTI",{"$f":"SUM(B20:B68)","v":7600},null,null,null,null,null,null,null,null,null,null,null,7600]
[]
[null,{"$f":"+B4","v":"2016-04-30"},"2016-05-31","2016-06-30","2016-07-31","2016-08-31","2016-09-30","2016-10-31","2016-11-30","2016-12-31","2017-01-31","2017-02-28","2017-03-31","TOTALE",null,{"$f":"+P4","v":"2017-04-30"},"2017-05-31","2017-06-30","2017-07-31","2017-08-31","2017-09-30","2017-10-31","2017-11-30","2017-12-31","2018-01-31","2018-02-28","2018-03-31","TOTALE",null,{"$f":"+AD4","v":"2018-04-30"},"2018-05-31","2018-06-30","2018-07-31","2018-08-31","2018-09-30","2018-10-31","2018-11-30","2018-12-31","2019-01-31","2019-02-28","2019-03-31","TOTALE"]
[{"$f":"+'5) INPUT COSTI FISSI'!A3","v":"Contributi"},{"$f":"+'5) INPUT COSTI FISSI'!B3","v":0},{"$f":"+'5) INPUT COSTI FISSI'!C3","v":0},{"$f":"+'5) INPUT COSTI FISSI'!D3","v":0},{"$f":"+'5) INPUT COSTI FISSI'!E3","v":0},{"$f":"+'5) INPUT COSTI FISSI'!F3","v":0},{"$f":"+'5) INPUT COSTI FISSI'!G3","v":0},{"$f":"+'5) INPUT COSTI FISSI'!H3","v":0},{"$f":"+'5) INPUT COSTI FISSI'!I3","v":0},{"$f":"+'5) INPUT COSTI FISSI'!J3","v":0},{"$f":"+'5) INPUT COSTI FISSI'!K3","v":0},{"$f":"+'5) INPUT COSTI FISSI'!L3","v":0},{"$f":"+'5) INPUT COSTI FISSI'!M3","v":0},{"$f":"+'5) INPUT COSTI FISSI'!N3","v":0},null,{"$f":"+'5) INPUT COSTI FISSI'!P3","v":0},{"$f":"+'5) INPUT COSTI FISSI'!Q3","v":0},{"$f":"+'5) INPUT COSTI FISSI'!R3","v":0},{"$f":"+'5) INPUT COSTI FISSI'!S3","v":0},{"$f":"+'5) INPUT COSTI FISSI'!T3","v":0},{"$f":"+'5) INPUT COSTI FISSI'!U3","v":0},{"$f":"+'5) INPUT COSTI FISSI'!V3","v":0},{"$f":"+'5) INPUT COSTI FISSI'!W3","v":0},{"$f":"+'5) INPUT COSTI FISSI'!X3","v":0},{"$f":"+'5) INPUT COSTI FISSI'!Y3","v":0},{"$f":"+'5) INPUT COSTI FISSI'!Z3","v":0},{"$f":"+'5) INPUT COSTI FISSI'!AA3","v":0},{"$f":"+'5) INPUT COSTI FISSI'!AB3","v":0},null,{"$f":"+'5) INPUT COSTI FISSI'!AD3","v":0},{"$f":"+'5) INPUT COSTI FISSI'!AE3","v":0},{"$f":"+'5) INPUT COSTI FISSI'!AF3","v":0},{"$f":"+'5) INPUT COSTI FISSI'!AG3","v":0},{"$f":"+'5) INPUT COSTI FISSI'!AH3","v":0},{"$f":"+'5) INPUT COSTI FISSI'!AI3","v":0},{"$f":"+'5) INPUT COSTI FISSI'!AJ3","v":0},{"$f":"+'5) INPUT COSTI FISSI'!AK3","v":0},{"$f":"+'5) INPUT COSTI FISSI'!AL3","v":0},{"$f":"+'5) INPUT COSTI FISSI'!AM3","v":0},{"$f":"+'5) INPUT COSTI FISSI'!AN3","v":0},{"$f":"+'5) INPUT COSTI FISSI'!AO3","v":0},{"$f":"+'5) INPUT COSTI FISSI'!AP3","v":0}]
[{"$f":"+'5) INPUT COSTI FISSI'!A4","v":"Imposta di registro"},{"$f":"+'5) INPUT COSTI FISSI'!B4","v":0},{"$f":"+'5) INPUT COSTI FISSI'!C4","v":0},{"$f":"+'5) INPUT COSTI FISSI'!D4","v":0},{"$f":"+'5) INPUT COSTI FISSI'!E4","v":0},{"$f":"+'5) INPUT COSTI FISSI'!F4","v":0},{"$f":"+'5) INPUT COSTI FISSI'!G4","v":0},{"$f":"+'5) INPUT COSTI FISSI'!H4","v":0},{"$f":"+'5) INPUT COSTI FISSI'!I4","v":0},{"$f":"+'5) INPUT COSTI FISSI'!J4","v":0},{"$f":"+'5) INPUT COSTI FISSI'!K4","v":0},{"$f":"+'5) INPUT COSTI FISSI'!L4","v":0},{"$f":"+'5) INPUT COSTI FISSI'!M4","v":0},{"$f":"+'5) INPUT COSTI FISSI'!N4","v":0},null,{"$f":"+'5) INPUT COSTI FISSI'!P4","v":0},{"$f":"+'5) INPUT COSTI FISSI'!Q4","v":0},{"$f":"+'5) INPUT COSTI FISSI'!R4","v":0},{"$f":"+'5) INPUT COSTI FISSI'!S4","v":0},{"$f":"+'5) INPUT COSTI FISSI'!T4","v":0},{"$f":"+'5) INPUT COSTI FISSI'!U4","v":0},{"$f":"+'5) INPUT COSTI FISSI'!V4","v":0},{"$f":"+'5) INPUT COSTI FISSI'!W4","v":0},{"$f":"+'5) INPUT COSTI FISSI'!X4","v":0},{"$f":"+'5) INPUT COSTI FISSI'!Y4","v":0},{"$f":"+'5) INPUT COSTI FISSI'!Z4","v":0},{"$f":"+'5) INPUT COSTI FISSI'!AA4","v":0},{"$f":"+'5) INPUT COSTI FISSI'!AB4","v":0},null,{"$f":"+'5) INPUT COSTI FISSI'!AD4","v":0},{"$f":"+'5) INPUT COSTI FISSI'!AE4","v":0},{"$f":"+'5) INPUT COSTI FISSI'!AF4","v":0},{"$f":"+'5) INPUT COSTI FISSI'!AG4","v":0},{"$f":"+'5) INPUT COSTI FISSI'!AH4","v":0},{"$f":"+'5) INPUT COSTI FISSI'!AI4","v":0},{"$f":"+'5) INPUT COSTI FISSI'!AJ4","v":0},{"$f":"+'5) INPUT COSTI FISSI'!AK4","v":0},{"$f":"+'5) INPUT COSTI FISSI'!AL4","v":0},{"$f":"+'5) INPUT COSTI FISSI'!AM4","v":0},{"$f":"+'5) INPUT COSTI FISSI'!AN4","v":0},{"$f":"+'5) INPUT COSTI FISSI'!AO4","v":0},{"$f":"+'5) INPUT COSTI FISSI'!AP4","v":0}]
[{"$f":"+'5) INPUT COSTI FISSI'!A5","v":"Affitto"},{"$f":"+'5) INPUT COSTI FISSI'!B5","v":0},{"$f":"+'5) INPUT COSTI FISSI'!C5","v":0},{"$f":"+'5) INPUT COSTI FISSI'!D5","v":0},{"$f":"+'5) INPUT COSTI FISSI'!E5","v":0},{"$f":"+'5) INPUT COSTI FISSI'!F5","v":0},{"$f":"+'5) INPUT COSTI FISSI'!G5","v":0},{"$f":"+'5) INPUT COSTI FISSI'!H5","v":0},{"$f":"+'5) INPUT COSTI FISSI'!I5","v":0},{"$f":"+'5) INPUT COSTI FISSI'!J5","v":0},{"$f":"+'5) INPUT COSTI FISSI'!K5","v":0},{"$f":"+'5) INPUT COSTI FISSI'!L5","v":0},{"$f":"+'5) INPUT COSTI FISSI'!M5","v":0},{"$f":"+'5) INPUT COSTI FISSI'!N5","v":0},null,{"$f":"+'5) INPUT COSTI FISSI'!P5","v":0},{"$f":"+'5) INPUT COSTI FISSI'!Q5","v":0},{"$f":"+'5) INPUT COSTI FISSI'!R5","v":0},{"$f":"+'5) INPUT COSTI FISSI'!S5","v":0},{"$f":"+'5) INPUT COSTI FISSI'!T5","v":0},{"$f":"+'5) INPUT COSTI FISSI'!U5","v":0},{"$f":"+'5) INPUT COSTI FISSI'!V5","v":0},{"$f":"+'5) INPUT COSTI FISSI'!W5","v":0},{"$f":"+'5) INPUT COSTI FISSI'!X5","v":0},{"$f":"+'5) INPUT COSTI FISSI'!Y5","v":0},{"$f":"+'5) INPUT COSTI FISSI'!Z5","v":0},{"$f":"+'5) INPUT COSTI FISSI'!AA5","v":0},{"$f":"+'5) INPUT COSTI FISSI'!AB5","v":0},null,{"$f":"+'5) INPUT COSTI FISSI'!AD5","v":0},{"$f":"+'5) INPUT COSTI FISSI'!AE5","v":0},{"$f":"+'5) INPUT COSTI FISSI'!AF5","v":0},{"$f":"+'5) INPUT COSTI FISSI'!AG5","v":0},{"$f":"+'5) INPUT COSTI FISSI'!AH5","v":0},{"$f":"+'5) INPUT COSTI FISSI'!AI5","v":0},{"$f":"+'5) INPUT COSTI FISSI'!AJ5","v":0},{"$f":"+'5) INPUT COSTI FISSI'!AK5","v":0},{"$f":"+'5) INPUT COSTI FISSI'!AL5","v":0},{"$f":"+'5) INPUT COSTI FISSI'!AM5","v":0},{"$f":"+'5) INPUT COSTI FISSI'!AN5","v":0},{"$f":"+'5) INPUT COSTI FISSI'!AO5","v":0},{"$f":"+'5) INPUT COSTI FISSI'!AP5","v":0}]
[{"$f":"+'5) INPUT COSTI FISSI'!A6","v":"Condominio"},{"$f":"+'5) INPUT COSTI FISSI'!B6","v":100},{"$f":"+'5) INPUT COSTI FISSI'!C6","v":100},{"$f":"+'5) INPUT COSTI FISSI'!D6","v":100},{"$f":"+'5) INPUT COSTI FISSI'!E6","v":100},{"$f":"+'5) INPUT COSTI FISSI'!F6","v":100},{"$f":"+'5) INPUT COSTI FISSI'!G6","v":100},{"$f":"+'5) INPUT COSTI FISSI'!H6","v":100},{"$f":"+'5) INPUT COSTI FISSI'!I6","v":100},{"$f":"+'5) INPUT COSTI FISSI'!J6","v":100},{"$f":"+'5) INPUT COSTI FISSI'!K6","v":100},{"$f":"+'5) INPUT COSTI FISSI'!L6","v":100},{"$f":"+'5) INPUT COSTI FISSI'!M6","v":100},{"$f":"+'5) INPUT COSTI FISSI'!N6","v":1200},null,{"$f":"+'5) INPUT COSTI FISSI'!P6","v":100},{"$f":"+'5) INPUT COSTI FISSI'!Q6","v":100},{"$f":"+'5) INPUT COSTI FISSI'!R6","v":100},{"$f":"+'5) INPUT COSTI FISSI'!S6","v":100},{"$f":"+'5) INPUT COSTI FISSI'!T6","v":100},{"$f":"+'5) INPUT COSTI FISSI'!U6","v":100},{"$f":"+'5) INPUT COSTI FISSI'!V6","v":100},{"$f":"+'5) INPUT COSTI FISSI'!W6","v":100},{"$f":"+'5) INPUT COSTI FISSI'!X6","v":100},{"$f":"+'5) INPUT COSTI FISSI'!Y6","v":100},{"$f":"+'5) INPUT COSTI FISSI'!Z6","v":100},{"$f":"+'5) INPUT COSTI FISSI'!AA6","v":100},{"$f":"+'5) INPUT COSTI FISSI'!AB6","v":1200},null,{"$f":"+'5) INPUT COSTI FISSI'!AD6","v":100},{"$f":"+'5) INPUT COSTI FISSI'!AE6","v":100},{"$f":"+'5) INPUT COSTI FISSI'!AF6","v":100},{"$f":"+'5) INPUT COSTI FISSI'!AG6","v":100},{"$f":"+'5) INPUT COSTI FISSI'!AH6","v":100},{"$f":"+'5) INPUT COSTI FISSI'!AI6","v":100},{"$f":"+'5) INPUT COSTI FISSI'!AJ6","v":100},{"$f":"+'5) INPUT COSTI FISSI'!AK6","v":100},{"$f":"+'5) INPUT COSTI FISSI'!AL6","v":100},{"$f":"+'5) INPUT COSTI FISSI'!AM6","v":100},{"$f":"+'5) INPUT COSTI FISSI'!AN6","v":100},{"$f":"+'5) INPUT COSTI FISSI'!AO6","v":100},{"$f":"+'5) INPUT COSTI FISSI'!AP6","v":1200}]
[{"$f":"+'5) INPUT COSTI FISSI'!A7","v":"Collaboratori occasionali/stagionali"},{"$f":"+'5) INPUT COSTI FISSI'!B7","v":0},{"$f":"+'5) INPUT COSTI FISSI'!C7","v":0},{"$f":"+'5) INPUT COSTI FISSI'!D7","v":0},{"$f":"+'5) INPUT COSTI FISSI'!E7","v":0},{"$f":"+'5) INPUT COSTI FISSI'!F7","v":0},{"$f":"+'5) INPUT COSTI FISSI'!G7","v":0},{"$f":"+'5) INPUT COSTI FISSI'!H7","v":0},{"$f":"+'5) INPUT COSTI FISSI'!I7","v":0},{"$f":"+'5) INPUT COSTI FISSI'!J7","v":0},{"$f":"+'5) INPUT COSTI FISSI'!K7","v":0},{"$f":"+'5) INPUT COSTI FISSI'!L7","v":0},{"$f":"+'5) INPUT COSTI FISSI'!M7","v":0},{"$f":"+'5) INPUT COSTI FISSI'!N7","v":0},null,{"$f":"+'5) INPUT COSTI FISSI'!P7","v":0},{"$f":"+'5) INPUT COSTI FISSI'!Q7","v":0},{"$f":"+'5) INPUT COSTI FISSI'!R7","v":0},{"$f":"+'5) INPUT COSTI FISSI'!S7","v":0},{"$f":"+'5) INPUT COSTI FISSI'!T7","v":0},{"$f":"+'5) INPUT COSTI FISSI'!U7","v":0},{"$f":"+'5) INPUT COSTI FISSI'!V7","v":0},{"$f":"+'5) INPUT COSTI FISSI'!W7","v":0},{"$f":"+'5) INPUT COSTI FISSI'!X7","v":0},{"$f":"+'5) INPUT COSTI FISSI'!Y7","v":0},{"$f":"+'5) INPUT COSTI FISSI'!Z7","v":0},{"$f":"+'5) INPUT COSTI FISSI'!AA7","v":0},{"$f":"+'5) INPUT COSTI FISSI'!AB7","v":0},null,{"$f":"+'5) INPUT COSTI FISSI'!AD7","v":0},{"$f":"+'5) INPUT COSTI FISSI'!AE7","v":0},{"$f":"+'5) INPUT COSTI FISSI'!AF7","v":0},{"$f":"+'5) INPUT COSTI FISSI'!AG7","v":0},{"$f":"+'5) INPUT COSTI FISSI'!AH7","v":0},{"$f":"+'5) INPUT COSTI FISSI'!AI7","v":0},{"$f":"+'5) INPUT COSTI FISSI'!AJ7","v":0},{"$f":"+'5) INPUT COSTI FISSI'!AK7","v":0},{"$f":"+'5) INPUT COSTI FISSI'!AL7","v":0},{"$f":"+'5) INPUT COSTI FISSI'!AM7","v":0},{"$f":"+'5) INPUT COSTI FISSI'!AN7","v":0},{"$f":"+'5) INPUT COSTI FISSI'!AO7","v":0},{"$f":"+'5) INPUT COSTI FISSI'!AP7","v":0}]
[{"$f":"+'5) INPUT COSTI FISSI'!A8","v":"Commercialista, consulente del lavoro, legale"},{"$f":"+'5) INPUT COSTI FISSI'!B8","v":0},{"$f":"+'5) INPUT COSTI FISSI'!C8","v":0},{"$f":"+'5) INPUT COSTI FISSI'!D8","v":0},{"$f":"+'5) INPUT COSTI FISSI'!E8","v":0},{"$f":"+'5) INPUT COSTI FISSI'!F8","v":0},{"$f":"+'5) INPUT COSTI FISSI'!G8","v":0},{"$f":"+'5) INPUT COSTI FISSI'!H8","v":0},{"$f":"+'5) INPUT COSTI FISSI'!I8","v":0},{"$f":"+'5) INPUT COSTI FISSI'!J8","v":0},{"$f":"+'5) INPUT COSTI FISSI'!K8","v":0},{"$f":"+'5) INPUT COSTI FISSI'!L8","v":0},{"$f":"+'5) INPUT COSTI FISSI'!M8","v":150},{"$f":"+'5) INPUT COSTI FISSI'!N8","v":150},null,{"$f":"+'5) INPUT COSTI FISSI'!P8","v":0},{"$f":"+'5) INPUT COSTI FISSI'!Q8","v":0},{"$f":"+'5) INPUT COSTI FISSI'!R8","v":0},{"$f":"+'5) INPUT COSTI FISSI'!S8","v":0},{"$f":"+'5) INPUT COSTI FISSI'!T8","v":0},{"$f":"+'5) INPUT COSTI FISSI'!U8","v":0},{"$f":"+'5) INPUT COSTI FISSI'!V8","v":0},{"$f":"+'5) INPUT COSTI FISSI'!W8","v":0},{"$f":"+'5) INPUT COSTI FISSI'!X8","v":0},{"$f":"+'5) INPUT COSTI FISSI'!Y8","v":0},{"$f":"+'5) INPUT COSTI FISSI'!Z8","v":0},{"$f":"+'5) INPUT COSTI FISSI'!AA8","v":150},{"$f":"+'5) INPUT COSTI FISSI'!AB8","v":150},null,{"$f":"+'5) INPUT COSTI FISSI'!AD8","v":0},{"$f":"+'5) INPUT COSTI FISSI'!AE8","v":0},{"$f":"+'5) INPUT COSTI FISSI'!AF8","v":0},{"$f":"+'5) INPUT COSTI FISSI'!AG8","v":0},{"$f":"+'5) INPUT COSTI FISSI'!AH8","v":0},{"$f":"+'5) INPUT COSTI FISSI'!AI8","v":0},{"$f":"+'5) INPUT COSTI FISSI'!AJ8","v":0},{"$f":"+'5) INPUT COSTI FISSI'!AK8","v":0},{"$f":"+'5) INPUT COSTI FISSI'!AL8","v":0},{"$f":"+'5) INPUT COSTI FISSI'!AM8","v":0},{"$f":"+'5) INPUT COSTI FISSI'!AN8","v":0},{"$f":"+'5) INPUT COSTI FISSI'!AO8","v":150},{"$f":"+'5) INPUT COSTI FISSI'!AP8","v":150}]
[{"$f":"+'5) INPUT COSTI FISSI'!A9","v":"Promozione post avvio"},{"$f":"+'5) INPUT COSTI FISSI'!B9","v":100},{"$f":"+'5) INPUT COSTI FISSI'!C9","v":100},{"$f":"+'5) INPUT COSTI FISSI'!D9","v":100},{"$f":"+'5) INPUT COSTI FISSI'!E9","v":100},{"$f":"+'5) INPUT COSTI FISSI'!F9","v":100},{"$f":"+'5) INPUT COSTI FISSI'!G9","v":100},{"$f":"+'5) INPUT COSTI FISSI'!H9","v":100},{"$f":"+'5) INPUT COSTI FISSI'!I9","v":100},{"$f":"+'5) INPUT COSTI FISSI'!J9","v":100},{"$f":"+'5) INPUT COSTI FISSI'!K9","v":100},{"$f":"+'5) INPUT COSTI FISSI'!L9","v":100},{"$f":"+'5) INPUT COSTI FISSI'!M9","v":100},{"$f":"+'5) INPUT COSTI FISSI'!N9","v":1200},null,{"$f":"+'5) INPUT COSTI FISSI'!P9","v":100},{"$f":"+'5) INPUT COSTI FISSI'!Q9","v":100},{"$f":"+'5) INPUT COSTI FISSI'!R9","v":100},{"$f":"+'5) INPUT COSTI FISSI'!S9","v":100},{"$f":"+'5) INPUT COSTI FISSI'!T9","v":100},{"$f":"+'5) INPUT COSTI FISSI'!U9","v":100},{"$f":"+'5) INPUT COSTI FISSI'!V9","v":100},{"$f":"+'5) INPUT COSTI FISSI'!W9","v":100},{"$f":"+'5) INPUT COSTI FISSI'!X9","v":100},{"$f":"+'5) INPUT COSTI FISSI'!Y9","v":100},{"$f":"+'5) INPUT COSTI FISSI'!Z9","v":100},{"$f":"+'5) INPUT COSTI FISSI'!AA9","v":100},{"$f":"+'5) INPUT COSTI FISSI'!AB9","v":1200},null,{"$f":"+'5) INPUT COSTI FISSI'!AD9","v":100},{"$f":"+'5) INPUT COSTI FISSI'!AE9","v":100},{"$f":"+'5) INPUT COSTI FISSI'!AF9","v":100},{"$f":"+'5) INPUT COSTI FISSI'!AG9","v":100},{"$f":"+'5) INPUT COSTI FISSI'!AH9","v":100},{"$f":"+'5) INPUT COSTI FISSI'!AI9","v":100},{"$f":"+'5) INPUT COSTI FISSI'!AJ9","v":100},{"$f":"+'5) INPUT COSTI FISSI'!AK9","v":100},{"$f":"+'5) INPUT COSTI FISSI'!AL9","v":100},{"$f":"+'5) INPUT COSTI FISSI'!AM9","v":100},{"$f":"+'5) INPUT COSTI FISSI'!AN9","v":100},{"$f":"+'5) INPUT COSTI FISSI'!AO9","v":100},{"$f":"+'5) INPUT COSTI FISSI'!AP9","v":1200}]
[{"$f":"+'5) INPUT COSTI FISSI'!A10","v":"Dominio, hosting e manutenzione sito internet"},{"$f":"+'5) INPUT COSTI FISSI'!B10","v":0},{"$f":"+'5) INPUT COSTI FISSI'!C10","v":0},{"$f":"+'5) INPUT COSTI FISSI'!D10","v":0},{"$f":"+'5) INPUT COSTI FISSI'!E10","v":0},{"$f":"+'5) INPUT COSTI FISSI'!F10","v":0},{"$f":"+'5) INPUT COSTI FISSI'!G10","v":0},{"$f":"+'5) INPUT COSTI FISSI'!H10","v":0},{"$f":"+'5) INPUT COSTI FISSI'!I10","v":0},{"$f":"+'5) INPUT COSTI FISSI'!J10","v":0},{"$f":"+'5) INPUT COSTI FISSI'!K10","v":0},{"$f":"+'5) INPUT COSTI FISSI'!L10","v":0},{"$f":"+'5) INPUT COSTI FISSI'!M10","v":100},{"$f":"+'5) INPUT COSTI FISSI'!N10","v":100},null,{"$f":"+'5) INPUT COSTI FISSI'!P10","v":0},{"$f":"+'5) INPUT COSTI FISSI'!Q10","v":0},{"$f":"+'5) INPUT COSTI FISSI'!R10","v":0},{"$f":"+'5) INPUT COSTI FISSI'!S10","v":0},{"$f":"+'5) INPUT COSTI FISSI'!T10","v":0},{"$f":"+'5) INPUT COSTI FISSI'!U10","v":0},{"$f":"+'5) INPUT COSTI FISSI'!V10","v":0},{"$f":"+'5) INPUT COSTI FISSI'!W10","v":0},{"$f":"+'5) INPUT COSTI FISSI'!X10","v":0},{"$f":"+'5) INPUT COSTI FISSI'!Y10","v":0},{"$f":"+'5) INPUT COSTI FISSI'!Z10","v":0},{"$f":"+'5) INPUT COSTI FISSI'!AA10","v":100},{"$f":"+'5) INPUT COSTI FISSI'!AB10","v":100},null,{"$f":"+'5) INPUT COSTI FISSI'!AD10","v":0},{"$f":"+'5) INPUT COSTI FISSI'!AE10","v":0},{"$f":"+'5) INPUT COSTI FISSI'!AF10","v":0},{"$f":"+'5) INPUT COSTI FISSI'!AG10","v":0},{"$f":"+'5) INPUT COSTI FISSI'!AH10","v":0},{"$f":"+'5) INPUT COSTI FISSI'!AI10","v":0},{"$f":"+'5) INPUT COSTI FISSI'!AJ10","v":0},{"$f":"+'5) INPUT COSTI FISSI'!AK10","v":0},{"$f":"+'5) INPUT COSTI FISSI'!AL10","v":0},{"$f":"+'5) INPUT COSTI FISSI'!AM10","v":0},{"$f":"+'5) INPUT COSTI FISSI'!AN10","v":0},{"$f":"+'5) INPUT COSTI FISSI'!AO10","v":100},{"$f":"+'5) INPUT COSTI FISSI'!AP10","v":100}]
[{"$f":"+'5) INPUT COSTI FISSI'!A11","v":"Noleggio POS"},{"$f":"+'5) INPUT COSTI FISSI'!B11","v":0},{"$f":"+'5) INPUT COSTI FISSI'!C11","v":0},{"$f":"+'5) INPUT COSTI FISSI'!D11","v":0},{"$f":"+'5) INPUT COSTI FISSI'!E11","v":0},{"$f":"+'5) INPUT COSTI FISSI'!F11","v":0},{"$f":"+'5) INPUT COSTI FISSI'!G11","v":0},{"$f":"+'5) INPUT COSTI FISSI'!H11","v":0},{"$f":"+'5) INPUT COSTI FISSI'!I11","v":0},{"$f":"+'5) INPUT COSTI FISSI'!J11","v":0},{"$f":"+'5) INPUT COSTI FISSI'!K11","v":0},{"$f":"+'5) INPUT COSTI FISSI'!L11","v":0},{"$f":"+'5) INPUT COSTI FISSI'!M11","v":0},{"$f":"+'5) INPUT COSTI FISSI'!N11","v":0},null,{"$f":"+'5) INPUT COSTI FISSI'!P11","v":0},{"$f":"+'5) INPUT COSTI FISSI'!Q11","v":0},{"$f":"+'5) INPUT COSTI FISSI'!R11","v":0},{"$f":"+'5) INPUT COSTI FISSI'!S11","v":0},{"$f":"+'5) INPUT COSTI FISSI'!T11","v":0},{"$f":"+'5) INPUT COSTI FISSI'!U11","v":0},{"$f":"+'5) INPUT COSTI FISSI'!V11","v":0},{"$f":"+'5) INPUT COSTI FISSI'!W11","v":0},{"$f":"+'5) INPUT COSTI FISSI'!X11","v":0},{"$f":"+'5) INPUT COSTI FISSI'!Y11","v":0},{"$f":"+'5) INPUT COSTI FISSI'!Z11","v":0},{"$f":"+'5) INPUT COSTI FISSI'!AA11","v":0},{"$f":"+'5) INPUT COSTI FISSI'!AB11","v":0},null,{"$f":"+'5) INPUT COSTI FISSI'!AD11","v":0},{"$f":"+'5) INPUT COSTI FISSI'!AE11","v":0},{"$f":"+'5) INPUT COSTI FISSI'!AF11","v":0},{"$f":"+'5) INPUT COSTI FISSI'!AG11","v":0},{"$f":"+'5) INPUT COSTI FISSI'!AH11","v":0},{"$f":"+'5) INPUT COSTI FISSI'!AI11","v":0},{"$f":"+'5) INPUT COSTI FISSI'!AJ11","v":0},{"$f":"+'5) INPUT COSTI FISSI'!AK11","v":0},{"$f":"+'5) INPUT COSTI FISSI'!AL11","v":0},{"$f":"+'5) INPUT COSTI FISSI'!AM11","v":0},{"$f":"+'5) INPUT COSTI FISSI'!AN11","v":0},{"$f":"+'5) INPUT COSTI FISSI'!AO11","v":0},{"$f":"+'5) INPUT COSTI FISSI'!AP11","v":0}]
[{"$f":"+'5) INPUT COSTI FISSI'!A12","v":"Manutenzioni e riparazioni"},{"$f":"+'5) INPUT COSTI FISSI'!B12","v":0},{"$f":"+'5) INPUT COSTI FISSI'!C12","v":0},{"$f":"+'5) INPUT COSTI FISSI'!D12","v":0},{"$f":"+'5) INPUT COSTI FISSI'!E12","v":0},{"$f":"+'5) INPUT COSTI FISSI'!F12","v":0},{"$f":"+'5) INPUT COSTI FISSI'!G12","v":0},{"$f":"+'5) INPUT COSTI FISSI'!H12","v":0},{"$f":"+'5) INPUT COSTI FISSI'!I12","v":0},{"$f":"+'5) INPUT COSTI FISSI'!J12","v":0},{"$f":"+'5) INPUT COSTI FISSI'!K12","v":0},{"$f":"+'5) INPUT COSTI FISSI'!L12","v":0},{"$f":"+'5) INPUT COSTI FISSI'!M12","v":500},{"$f":"+'5) INPUT COSTI FISSI'!N12","v":500},null,{"$f":"+'5) INPUT COSTI FISSI'!P12","v":0},{"$f":"+'5) INPUT COSTI FISSI'!Q12","v":0},{"$f":"+'5) INPUT COSTI FISSI'!R12","v":0},{"$f":"+'5) INPUT COSTI FISSI'!S12","v":0},{"$f":"+'5) INPUT COSTI FISSI'!T12","v":0},{"$f":"+'5) INPUT COSTI FISSI'!U12","v":0},{"$f":"+'5) INPUT COSTI FISSI'!V12","v":0},{"$f":"+'5) INPUT COSTI FISSI'!W12","v":0},{"$f":"+'5) INPUT COSTI FISSI'!X12","v":0},{"$f":"+'5) INPUT COSTI FISSI'!Y12","v":0},{"$f":"+'5) INPUT COSTI FISSI'!Z12","v":0},{"$f":"+'5) INPUT COSTI FISSI'!AA12","v":500},{"$f":"+'5) INPUT COSTI FISSI'!AB12","v":500},null,{"$f":"+'5) INPUT COSTI FISSI'!AD12","v":0},{"$f":"+'5) INPUT COSTI FISSI'!AE12","v":0},{"$f":"+'5) INPUT COSTI FISSI'!AF12","v":0},{"$f":"+'5) INPUT COSTI FISSI'!AG12","v":0},{"$f":"+'5) INPUT COSTI FISSI'!AH12","v":0},{"$f":"+'5) INPUT COSTI FISSI'!AI12","v":0},{"$f":"+'5) INPUT COSTI FISSI'!AJ12","v":0},{"$f":"+'5) INPUT COSTI FISSI'!AK12","v":0},{"$f":"+'5) INPUT COSTI FISSI'!AL12","v":0},{"$f":"+'5) INPUT COSTI FISSI'!AM12","v":0},{"$f":"+'5) INPUT COSTI FISSI'!AN12","v":0},{"$f":"+'5) INPUT COSTI FISSI'!AO12","v":500},{"$f":"+'5) INPUT COSTI FISSI'!AP12","v":500}]
[{"$f":"+'5) INPUT COSTI FISSI'!A13","v":"Energia elettrica"},{"$f":"+'5) INPUT COSTI FISSI'!B13","v":0},{"$f":"+'5) INPUT COSTI FISSI'!C13","v":100},{"$f":"+'5) INPUT COSTI FISSI'!D13","v":0},{"$f":"+'5) INPUT COSTI FISSI'!E13","v":100},{"$f":"+'5) INPUT COSTI FISSI'!F13","v":0},{"$f":"+'5) INPUT COSTI FISSI'!G13","v":100},{"$f":"+'5) INPUT COSTI FISSI'!H13","v":0},{"$f":"+'5) INPUT COSTI FISSI'!I13","v":100},{"$f":"+'5) INPUT COSTI FISSI'!J13","v":0},{"$f":"+'5) INPUT COSTI FISSI'!K13","v":100},{"$f":"+'5) INPUT COSTI FISSI'!L13","v":0},{"$f":"+'5) INPUT COSTI FISSI'!M13","v":100},{"$f":"+'5) INPUT COSTI FISSI'!N13","v":600},null,{"$f":"+'5) INPUT COSTI FISSI'!P13","v":0},{"$f":"+'5) INPUT COSTI FISSI'!Q13","v":100},{"$f":"+'5) INPUT COSTI FISSI'!R13","v":0},{"$f":"+'5) INPUT COSTI FISSI'!S13","v":100},{"$f":"+'5) INPUT COSTI FISSI'!T13","v":0},{"$f":"+'5) INPUT COSTI FISSI'!U13","v":100},{"$f":"+'5) INPUT COSTI FISSI'!V13","v":0},{"$f":"+'5) INPUT COSTI FISSI'!W13","v":100},{"$f":"+'5) INPUT COSTI FISSI'!X13","v":0},{"$f":"+'5) INPUT COSTI FISSI'!Y13","v":100},{"$f":"+'5) INPUT COSTI FISSI'!Z13","v":0},{"$f":"+'5) INPUT COSTI FISSI'!AA13","v":100},{"$f":"+'5) INPUT COSTI FISSI'!AB13","v":600},null,{"$f":"+'5) INPUT COSTI FISSI'!AD13","v":0},{"$f":"+'5) INPUT COSTI FISSI'!AE13","v":100},{"$f":"+'5) INPUT COSTI FISSI'!AF13","v":0},{"$f":"+'5) INPUT COSTI FISSI'!AG13","v":100},{"$f":"+'5) INPUT COSTI FISSI'!AH13","v":0},{"$f":"+'5) INPUT COSTI FISSI'!AI13","v":100},{"$f":"+'5) INPUT COSTI FISSI'!AJ13","v":0},{"$f":"+'5) INPUT COSTI FISSI'!AK13","v":100},{"$f":"+'5) INPUT COSTI FISSI'!AL13","v":0},{"$f":"+'5) INPUT COSTI FISSI'!AM13","v":100},{"$f":"+'5) INPUT COSTI FISSI'!AN13","v":0},{"$f":"+'5) INPUT COSTI FISSI'!AO13","v":100},{"$f":"+'5) INPUT COSTI FISSI'!AP13","v":600}]
[{"$f":"+'5) INPUT COSTI FISSI'!A14","v":"Spese telefoniche/Internet"},{"$f":"+'5) INPUT COSTI FISSI'!B14","v":30},{"$f":"+'5) INPUT COSTI FISSI'!C14","v":30},{"$f":"+'5) INPUT COSTI FISSI'!D14","v":30},{"$f":"+'5) INPUT COSTI FISSI'!E14","v":30},{"$f":"+'5) INPUT COSTI FISSI'!F14","v":30},{"$f":"+'5) INPUT COSTI FISSI'!G14","v":30},{"$f":"+'5) INPUT COSTI FISSI'!H14","v":30},{"$f":"+'5) INPUT COSTI FISSI'!I14","v":30},{"$f":"+'5) INPUT COSTI FISSI'!J14","v":30},{"$f":"+'5) INPUT COSTI FISSI'!K14","v":30},{"$f":"+'5) INPUT COSTI FISSI'!L14","v":30},{"$f":"+'5) INPUT COSTI FISSI'!M14","v":30},{"$f":"+'5) INPUT COSTI FISSI'!N14","v":360},null,{"$f":"+'5) INPUT COSTI FISSI'!P14","v":30},{"$f":"+'5) INPUT COSTI FISSI'!Q14","v":30},{"$f":"+'5) INPUT COSTI FISSI'!R14","v":30},{"$f":"+'5) INPUT COSTI FISSI'!S14","v":30},{"$f":"+'5) INPUT COSTI FISSI'!T14","v":30},{"$f":"+'5) INPUT COSTI FISSI'!U14","v":30},{"$f":"+'5) INPUT COSTI FISSI'!V14","v":30},{"$f":"+'5) INPUT COSTI FISSI'!W14","v":30},{"$f":"+'5) INPUT COSTI FISSI'!X14","v":30},{"$f":"+'5) INPUT COSTI FISSI'!Y14","v":30},{"$f":"+'5) INPUT COSTI FISSI'!Z14","v":30},{"$f":"+'5) INPUT COSTI FISSI'!AA14","v":30},{"$f":"+'5) INPUT COSTI FISSI'!AB14","v":360},null,{"$f":"+'5) INPUT COSTI FISSI'!AD14","v":30},{"$f":"+'5) INPUT COSTI FISSI'!AE14","v":30},{"$f":"+'5) INPUT COSTI FISSI'!AF14","v":30},{"$f":"+'5) INPUT COSTI FISSI'!AG14","v":30},{"$f":"+'5) INPUT COSTI FISSI'!AH14","v":30},{"$f":"+'5) INPUT COSTI FISSI'!AI14","v":30},{"$f":"+'5) INPUT COSTI FISSI'!AJ14","v":30},{"$f":"+'5) INPUT COSTI FISSI'!AK14","v":30},{"$f":"+'5) INPUT COSTI FISSI'!AL14","v":30},{"$f":"+'5) INPUT COSTI FISSI'!AM14","v":30},{"$f":"+'5) INPUT COSTI FISSI'!AN14","v":30},{"$f":"+'5) INPUT COSTI FISSI'!AO14","v":30},{"$f":"+'5) INPUT COSTI FISSI'!AP14","v":360}]
[{"$f":"+'5) INPUT COSTI FISSI'!A15","v":"Acqua"},{"$f":"+'5) INPUT COSTI FISSI'!B15","v":0},{"$f":"+'5) INPUT COSTI FISSI'!C15","v":60},{"$f":"+'5) INPUT COSTI FISSI'!D15","v":0},{"$f":"+'5) INPUT COSTI FISSI'!E15","v":60},{"$f":"+'5) INPUT COSTI FISSI'!F15","v":0},{"$f":"+'5) INPUT COSTI FISSI'!G15","v":60},{"$f":"+'5) INPUT COSTI FISSI'!H15","v":0},{"$f":"+'5) INPUT COSTI FISSI'!I15","v":60},{"$f":"+'5) INPUT COSTI FISSI'!J15","v":0},{"$f":"+'5) INPUT COSTI FISSI'!K15","v":60},{"$f":"+'5) INPUT COSTI FISSI'!L15","v":0},{"$f":"+'5) INPUT COSTI FISSI'!M15","v":60},{"$f":"+'5) INPUT COSTI FISSI'!N15","v":360},null,{"$f":"+'5) INPUT COSTI FISSI'!P15","v":0},{"$f":"+'5) INPUT COSTI FISSI'!Q15","v":60},{"$f":"+'5) INPUT COSTI FISSI'!R15","v":0},{"$f":"+'5) INPUT COSTI FISSI'!S15","v":60},{"$f":"+'5) INPUT COSTI FISSI'!T15","v":0},{"$f":"+'5) INPUT COSTI FISSI'!U15","v":60},{"$f":"+'5) INPUT COSTI FISSI'!V15","v":0},{"$f":"+'5) INPUT COSTI FISSI'!W15","v":60},{"$f":"+'5) INPUT COSTI FISSI'!X15","v":0},{"$f":"+'5) INPUT COSTI FISSI'!Y15","v":60},{"$f":"+'5) INPUT COSTI FISSI'!Z15","v":0},{"$f":"+'5) INPUT COSTI FISSI'!AA15","v":60},{"$f":"+'5) INPUT COSTI FISSI'!AB15","v":360},null,{"$f":"+'5) INPUT COSTI FISSI'!AD15","v":0},{"$f":"+'5) INPUT COSTI FISSI'!AE15","v":60},{"$f":"+'5) INPUT COSTI FISSI'!AF15","v":0},{"$f":"+'5) INPUT COSTI FISSI'!AG15","v":60},{"$f":"+'5) INPUT COSTI FISSI'!AH15","v":0},{"$f":"+'5) INPUT COSTI FISSI'!AI15","v":60},{"$f":"+'5) INPUT COSTI FISSI'!AJ15","v":0},{"$f":"+'5) INPUT COSTI FISSI'!AK15","v":60},{"$f":"+'5) INPUT COSTI FISSI'!AL15","v":0},{"$f":"+'5) INPUT COSTI FISSI'!AM15","v":60},{"$f":"+'5) INPUT COSTI FISSI'!AN15","v":0},{"$f":"+'5) INPUT COSTI FISSI'!AO15","v":60},{"$f":"+'5) INPUT COSTI FISSI'!AP15","v":360}]
[{"$f":"+'5) INPUT COSTI FISSI'!A16","v":"Metano/gas"},{"$f":"+'5) INPUT COSTI FISSI'!B16","v":0},{"$f":"+'5) INPUT COSTI FISSI'!C16","v":0},{"$f":"+'5) INPUT COSTI FISSI'!D16","v":0},{"$f":"+'5) INPUT COSTI FISSI'!E16","v":0},{"$f":"+'5) INPUT COSTI FISSI'!F16","v":0},{"$f":"+'5) INPUT COSTI FISSI'!G16","v":0},{"$f":"+'5) INPUT COSTI FISSI'!H16","v":0},{"$f":"+'5) INPUT COSTI FISSI'!I16","v":0},{"$f":"+'5) INPUT COSTI FISSI'!J16","v":0},{"$f":"+'5) INPUT COSTI FISSI'!K16","v":0},{"$f":"+'5) INPUT COSTI FISSI'!L16","v":0},{"$f":"+'5) INPUT COSTI FISSI'!M16","v":0},{"$f":"+'5) INPUT COSTI FISSI'!N16","v":0},null,{"$f":"+'5) INPUT COSTI FISSI'!P16","v":0},{"$f":"+'5) INPUT COSTI FISSI'!Q16","v":0},{"$f":"+'5) INPUT COSTI FISSI'!R16","v":0},{"$f":"+'5) INPUT COSTI FISSI'!S16","v":0},{"$f":"+'5) INPUT COSTI FISSI'!T16","v":0},{"$f":"+'5) INPUT COSTI FISSI'!U16","v":0},{"$f":"+'5) INPUT COSTI FISSI'!V16","v":0},{"$f":"+'5) INPUT COSTI FISSI'!W16","v":0},{"$f":"+'5) INPUT COSTI FISSI'!X16","v":0},{"$f":"+'5) INPUT COSTI FISSI'!Y16","v":0},{"$f":"+'5) INPUT COSTI FISSI'!Z16","v":0},{"$f":"+'5) INPUT COSTI FISSI'!AA16","v":0},{"$f":"+'5) INPUT COSTI FISSI'!AB16","v":0},null,{"$f":"+'5) INPUT COSTI FISSI'!AD16","v":0},{"$f":"+'5) INPUT COSTI FISSI'!AE16","v":0},{"$f":"+'5) INPUT COSTI FISSI'!AF16","v":0},{"$f":"+'5) INPUT COSTI FISSI'!AG16","v":0},{"$f":"+'5) INPUT COSTI FISSI'!AH16","v":0},{"$f":"+'5) INPUT COSTI FISSI'!AI16","v":0},{"$f":"+'5) INPUT COSTI FISSI'!AJ16","v":0},{"$f":"+'5) INPUT COSTI FISSI'!AK16","v":0},{"$f":"+'5) INPUT COSTI FISSI'!AL16","v":0},{"$f":"+'5) INPUT COSTI FISSI'!AM16","v":0},{"$f":"+'5) INPUT COSTI FISSI'!AN16","v":0},{"$f":"+'5) INPUT COSTI FISSI'!AO16","v":0},{"$f":"+'5) INPUT COSTI FISSI'!AP16","v":0}]
[{"$f":"+'5) INPUT COSTI FISSI'!A17","v":"Condominio"},{"$f":"+'5) INPUT COSTI FISSI'!B17","v":0},{"$f":"+'5) INPUT COSTI FISSI'!C17","v":0},{"$f":"+'5) INPUT COSTI FISSI'!D17","v":0},{"$f":"+'5) INPUT COSTI FISSI'!E17","v":0},{"$f":"+'5) INPUT COSTI FISSI'!F17","v":0},{"$f":"+'5) INPUT COSTI FISSI'!G17","v":0},{"$f":"+'5) INPUT COSTI FISSI'!H17","v":0},{"$f":"+'5) INPUT COSTI FISSI'!I17","v":0},{"$f":"+'5) INPUT COSTI FISSI'!J17","v":0},{"$f":"+'5) INPUT COSTI FISSI'!K17","v":0},{"$f":"+'5) INPUT COSTI FISSI'!L17","v":0},{"$f":"+'5) INPUT COSTI FISSI'!M17","v":0},{"$f":"+'5) INPUT COSTI FISSI'!N17","v":0},null,{"$f":"+'5) INPUT COSTI FISSI'!P17","v":0},{"$f":"+'5) INPUT COSTI FISSI'!Q17","v":0},{"$f":"+'5) INPUT COSTI FISSI'!R17","v":0},{"$f":"+'5) INPUT COSTI FISSI'!S17","v":0},{"$f":"+'5) INPUT COSTI FISSI'!T17","v":0},{"$f":"+'5) INPUT COSTI FISSI'!U17","v":0},{"$f":"+'5) INPUT COSTI FISSI'!V17","v":0},{"$f":"+'5) INPUT COSTI FISSI'!W17","v":0},{"$f":"+'5) INPUT COSTI FISSI'!X17","v":0},{"$f":"+'5) INPUT COSTI FISSI'!Y17","v":0},{"$f":"+'5) INPUT COSTI FISSI'!Z17","v":0},{"$f":"+'5) INPUT COSTI FISSI'!AA17","v":0},{"$f":"+'5) INPUT COSTI FISSI'!AB17","v":0},null,{"$f":"+'5) INPUT COSTI FISSI'!AD17","v":0},{"$f":"+'5) INPUT COSTI FISSI'!AE17","v":0},{"$f":"+'5) INPUT COSTI FISSI'!AF17","v":0},{"$f":"+'5) INPUT COSTI FISSI'!AG17","v":0},{"$f":"+'5) INPUT COSTI FISSI'!AH17","v":0},{"$f":"+'5) INPUT COSTI FISSI'!AI17","v":0},{"$f":"+'5) INPUT COSTI FISSI'!AJ17","v":0},{"$f":"+'5) INPUT COSTI FISSI'!AK17","v":0},{"$f":"+'5) INPUT COSTI FISSI'!AL17","v":0},{"$f":"+'5) INPUT COSTI FISSI'!AM17","v":0},{"$f":"+'5) INPUT COSTI FISSI'!AN17","v":0},{"$f":"+'5) INPUT COSTI FISSI'!AO17","v":0},{"$f":"+'5) INPUT COSTI FISSI'!AP17","v":0}]
[{"$f":"+'5) INPUT COSTI FISSI'!A18","v":"Marche da bollo"},{"$f":"+'5) INPUT COSTI FISSI'!B18","v":0},{"$f":"+'5) INPUT COSTI FISSI'!C18","v":0},{"$f":"+'5) INPUT COSTI FISSI'!D18","v":0},{"$f":"+'5) INPUT COSTI FISSI'!E18","v":0},{"$f":"+'5) INPUT COSTI FISSI'!F18","v":0},{"$f":"+'5) INPUT COSTI FISSI'!G18","v":0},{"$f":"+'5) INPUT COSTI FISSI'!H18","v":0},{"$f":"+'5) INPUT COSTI FISSI'!I18","v":0},{"$f":"+'5) INPUT COSTI FISSI'!J18","v":0},{"$f":"+'5) INPUT COSTI FISSI'!K18","v":0},{"$f":"+'5) INPUT COSTI FISSI'!L18","v":0},{"$f":"+'5) INPUT COSTI FISSI'!M18","v":0},{"$f":"+'5) INPUT COSTI FISSI'!N18","v":0},null,{"$f":"+'5) INPUT COSTI FISSI'!P18","v":0},{"$f":"+'5) INPUT COSTI FISSI'!Q18","v":0},{"$f":"+'5) INPUT COSTI FISSI'!R18","v":0},{"$f":"+'5) INPUT COSTI FISSI'!S18","v":0},{"$f":"+'5) INPUT COSTI FISSI'!T18","v":0},{"$f":"+'5) INPUT COSTI FISSI'!U18","v":0},{"$f":"+'5) INPUT COSTI FISSI'!V18","v":0},{"$f":"+'5) INPUT COSTI FISSI'!W18","v":0},{"$f":"+'5) INPUT COSTI FISSI'!X18","v":0},{"$f":"+'5) INPUT COSTI FISSI'!Y18","v":0},{"$f":"+'5) INPUT COSTI FISSI'!Z18","v":0},{"$f":"+'5) INPUT COSTI FISSI'!AA18","v":0},{"$f":"+'5) INPUT COSTI FISSI'!AB18","v":0},null,{"$f":"+'5) INPUT COSTI FISSI'!AD18","v":0},{"$f":"+'5) INPUT COSTI FISSI'!AE18","v":0},{"$f":"+'5) INPUT COSTI FISSI'!AF18","v":0},{"$f":"+'5) INPUT COSTI FISSI'!AG18","v":0},{"$f":"+'5) INPUT COSTI FISSI'!AH18","v":0},{"$f":"+'5) INPUT COSTI FISSI'!AI18","v":0},{"$f":"+'5) INPUT COSTI FISSI'!AJ18","v":0},{"$f":"+'5) INPUT COSTI FISSI'!AK18","v":0},{"$f":"+'5) INPUT COSTI FISSI'!AL18","v":0},{"$f":"+'5) INPUT COSTI FISSI'!AM18","v":0},{"$f":"+'5) INPUT COSTI FISSI'!AN18","v":0},{"$f":"+'5) INPUT COSTI FISSI'!AO18","v":0},{"$f":"+'5) INPUT COSTI FISSI'!AP18","v":0}]
[{"$f":"+'5) INPUT COSTI FISSI'!A19","v":"Assicurazioni"},{"$f":"+'5) INPUT COSTI FISSI'!B19","v":150},{"$f":"+'5) INPUT COSTI FISSI'!C19","v":0},{"$f":"+'5) INPUT COSTI FISSI'!D19","v":0},{"$f":"+'5) INPUT COSTI FISSI'!E19","v":0},{"$f":"+'5) INPUT COSTI FISSI'!F19","v":0},{"$f":"+'5) INPUT COSTI FISSI'!G19","v":0},{"$f":"+'5) INPUT COSTI FISSI'!H19","v":0},{"$f":"+'5) INPUT COSTI FISSI'!I19","v":0},{"$f":"+'5) INPUT COSTI FISSI'!J19","v":0},{"$f":"+'5) INPUT COSTI FISSI'!K19","v":0},{"$f":"+'5) INPUT COSTI FISSI'!L19","v":0},{"$f":"+'5) INPUT COSTI FISSI'!M19","v":0},{"$f":"+'5) INPUT COSTI FISSI'!N19","v":150},null,{"$f":"+'5) INPUT COSTI FISSI'!P19","v":150},{"$f":"+'5) INPUT COSTI FISSI'!Q19","v":0},{"$f":"+'5) INPUT COSTI FISSI'!R19","v":0},{"$f":"+'5) INPUT COSTI FISSI'!S19","v":0},{"$f":"+'5) INPUT COSTI FISSI'!T19","v":0},{"$f":"+'5) INPUT COSTI FISSI'!U19","v":0},{"$f":"+'5) INPUT COSTI FISSI'!V19","v":0},{"$f":"+'5) INPUT COSTI FISSI'!W19","v":0},{"$f":"+'5) INPUT COSTI FISSI'!X19","v":0},{"$f":"+'5) INPUT COSTI FISSI'!Y19","v":0},{"$f":"+'5) INPUT COSTI FISSI'!Z19","v":0},{"$f":"+'5) INPUT COSTI FISSI'!AA19","v":0},{"$f":"+'5) INPUT COSTI FISSI'!AB19","v":150},null,{"$f":"+'5) INPUT COSTI FISSI'!AD19","v":150},{"$f":"+'5) INPUT COSTI FISSI'!AE19","v":0},{"$f":"+'5) INPUT COSTI FISSI'!AF19","v":0},{"$f":"+'5) INPUT COSTI FISSI'!AG19","v":0},{"$f":"+'5) INPUT COSTI FISSI'!AH19","v":0},{"$f":"+'5) INPUT COSTI FISSI'!AI19","v":0},{"$f":"+'5) INPUT COSTI FISSI'!AJ19","v":0},{"$f":"+'5) INPUT COSTI FISSI'!AK19","v":0},{"$f":"+'5) INPUT COSTI FISSI'!AL19","v":0},{"$f":"+'5) INPUT COSTI FISSI'!AM19","v":0},{"$f":"+'5) INPUT COSTI FISSI'!AN19","v":0},{"$f":"+'5) INPUT COSTI FISSI'!AO19","v":0},{"$f":"+'5) INPUT COSTI FISSI'!AP19","v":150}]
[{"$f":"+'5) INPUT COSTI FISSI'!A20","v":"Prodotti per la pulizia dei locali"},{"$f":"+'5) INPUT COSTI FISSI'!B20","v":50},{"$f":"+'5) INPUT COSTI FISSI'!C20","v":0},{"$f":"+'5) INPUT COSTI FISSI'!D20","v":0},{"$f":"+'5) INPUT COSTI FISSI'!E20","v":50},{"$f":"+'5) INPUT COSTI FISSI'!F20","v":0},{"$f":"+'5) INPUT COSTI FISSI'!G20","v":0},{"$f":"+'5) INPUT COSTI FISSI'!H20","v":50},{"$f":"+'5) INPUT COSTI FISSI'!I20","v":0},{"$f":"+'5) INPUT COSTI FISSI'!J20","v":0},{"$f":"+'5) INPUT COSTI FISSI'!K20","v":50},{"$f":"+'5) INPUT COSTI FISSI'!L20","v":0},{"$f":"+'5) INPUT COSTI FISSI'!M20","v":0},{"$f":"+'5) INPUT COSTI FISSI'!N20","v":200},null,{"$f":"+'5) INPUT COSTI FISSI'!P20","v":50},{"$f":"+'5) INPUT COSTI FISSI'!Q20","v":0},{"$f":"+'5) INPUT COSTI FISSI'!R20","v":0},{"$f":"+'5) INPUT COSTI FISSI'!S20","v":50},{"$f":"+'5) INPUT COSTI FISSI'!T20","v":0},{"$f":"+'5) INPUT COSTI FISSI'!U20","v":0},{"$f":"+'5) INPUT COSTI FISSI'!V20","v":50},{"$f":"+'5) INPUT COSTI FISSI'!W20","v":0},{"$f":"+'5) INPUT COSTI FISSI'!X20","v":0},{"$f":"+'5) INPUT COSTI FISSI'!Y20","v":50},{"$f":"+'5) INPUT COSTI FISSI'!Z20","v":0},{"$f":"+'5) INPUT COSTI FISSI'!AA20","v":0},{"$f":"+'5) INPUT COSTI FISSI'!AB20","v":200},null,{"$f":"+'5) INPUT COSTI FISSI'!AD20","v":50},{"$f":"+'5) INPUT COSTI FISSI'!AE20","v":0},{"$f":"+'5) INPUT COSTI FISSI'!AF20","v":0},{"$f":"+'5) INPUT COSTI FISSI'!AG20","v":50},{"$f":"+'5) INPUT COSTI FISSI'!AH20","v":0},{"$f":"+'5) INPUT COSTI FISSI'!AI20","v":0},{"$f":"+'5) INPUT COSTI FISSI'!AJ20","v":50},{"$f":"+'5) INPUT COSTI FISSI'!AK20","v":0},{"$f":"+'5) INPUT COSTI FISSI'!AL20","v":0},{"$f":"+'5) INPUT COSTI FISSI'!AM20","v":50},{"$f":"+'5) INPUT COSTI FISSI'!AN20","v":0},{"$f":"+'5) INPUT COSTI FISSI'!AO20","v":0},{"$f":"+'5) INPUT COSTI FISSI'!AP20","v":200}]
[{"$f":"+'5) INPUT COSTI FISSI'!A21","v":"Pulizia"},{"$f":"+'5) INPUT COSTI FISSI'!B21","v":0},{"$f":"+'5) INPUT COSTI FISSI'!C21","v":0},{"$f":"+'5) INPUT COSTI FISSI'!D21","v":0},{"$f":"+'5) INPUT COSTI FISSI'!E21","v":0},{"$f":"+'5) INPUT COSTI FISSI'!F21","v":0},{"$f":"+'5) INPUT COSTI FISSI'!G21","v":0},{"$f":"+'5) INPUT COSTI FISSI'!H21","v":0},{"$f":"+'5) INPUT COSTI FISSI'!I21","v":0},{"$f":"+'5) INPUT COSTI FISSI'!J21","v":0},{"$f":"+'5) INPUT COSTI FISSI'!K21","v":0},{"$f":"+'5) INPUT COSTI FISSI'!L21","v":0},{"$f":"+'5) INPUT COSTI FISSI'!M21","v":0},{"$f":"+'5) INPUT COSTI FISSI'!N21","v":0},null,{"$f":"+'5) INPUT COSTI FISSI'!P21","v":0},{"$f":"+'5) INPUT COSTI FISSI'!Q21","v":0},{"$f":"+'5) INPUT COSTI FISSI'!R21","v":0},{"$f":"+'5) INPUT COSTI FISSI'!S21","v":0},{"$f":"+'5) INPUT COSTI FISSI'!T21","v":0},{"$f":"+'5) INPUT COSTI FISSI'!U21","v":0},{"$f":"+'5) INPUT COSTI FISSI'!V21","v":0},{"$f":"+'5) INPUT COSTI FISSI'!W21","v":0},{"$f":"+'5) INPUT COSTI FISSI'!X21","v":0},{"$f":"+'5) INPUT COSTI FISSI'!Y21","v":0},{"$f":"+'5) INPUT COSTI FISSI'!Z21","v":0},{"$f":"+'5) INPUT COSTI FISSI'!AA21","v":0},{"$f":"+'5) INPUT COSTI FISSI'!AB21","v":0},null,{"$f":"+'5) INPUT COSTI FISSI'!AD21","v":0},{"$f":"+'5) INPUT COSTI FISSI'!AE21","v":0},{"$f":"+'5) INPUT COSTI FISSI'!AF21","v":0},{"$f":"+'5) INPUT COSTI FISSI'!AG21","v":0},{"$f":"+'5) INPUT COSTI FISSI'!AH21","v":0},{"$f":"+'5) INPUT COSTI FISSI'!AI21","v":0},{"$f":"+'5) INPUT COSTI FISSI'!AJ21","v":0},{"$f":"+'5) INPUT COSTI FISSI'!AK21","v":0},{"$f":"+'5) INPUT COSTI FISSI'!AL21","v":0},{"$f":"+'5) INPUT COSTI FISSI'!AM21","v":0},{"$f":"+'5) INPUT COSTI FISSI'!AN21","v":0},{"$f":"+'5) INPUT COSTI FISSI'!AO21","v":0},{"$f":"+'5) INPUT COSTI FISSI'!AP21","v":0}]
[{"$f":"+'5) INPUT COSTI FISSI'!A22","v":"Guardianaggio"},{"$f":"+'5) INPUT COSTI FISSI'!B22","v":0},{"$f":"+'5) INPUT COSTI FISSI'!C22","v":0},{"$f":"+'5) INPUT COSTI FISSI'!D22","v":0},{"$f":"+'5) INPUT COSTI FISSI'!E22","v":0},{"$f":"+'5) INPUT COSTI FISSI'!F22","v":0},{"$f":"+'5) INPUT COSTI FISSI'!G22","v":0},{"$f":"+'5) INPUT COSTI FISSI'!H22","v":0},{"$f":"+'5) INPUT COSTI FISSI'!I22","v":0},{"$f":"+'5) INPUT COSTI FISSI'!J22","v":0},{"$f":"+'5) INPUT COSTI FISSI'!K22","v":0},{"$f":"+'5) INPUT COSTI FISSI'!L22","v":0},{"$f":"+'5) INPUT COSTI FISSI'!M22","v":0},{"$f":"+'5) INPUT COSTI FISSI'!N22","v":0},null,{"$f":"+'5) INPUT COSTI FISSI'!P22","v":0},{"$f":"+'5) INPUT COSTI FISSI'!Q22","v":0},{"$f":"+'5) INPUT COSTI FISSI'!R22","v":0},{"$f":"+'5) INPUT COSTI FISSI'!S22","v":0},{"$f":"+'5) INPUT COSTI FISSI'!T22","v":0},{"$f":"+'5) INPUT COSTI FISSI'!U22","v":0},{"$f":"+'5) INPUT COSTI FISSI'!V22","v":0},{"$f":"+'5) INPUT COSTI FISSI'!W22","v":0},{"$f":"+'5) INPUT COSTI FISSI'!X22","v":0},{"$f":"+'5) INPUT COSTI FISSI'!Y22","v":0},{"$f":"+'5) INPUT COSTI FISSI'!Z22","v":0},{"$f":"+'5) INPUT COSTI FISSI'!AA22","v":0},{"$f":"+'5) INPUT COSTI FISSI'!AB22","v":0},null,{"$f":"+'5) INPUT COSTI FISSI'!AD22","v":0},{"$f":"+'5) INPUT COSTI FISSI'!AE22","v":0},{"$f":"+'5) INPUT COSTI FISSI'!AF22","v":0},{"$f":"+'5) INPUT COSTI FISSI'!AG22","v":0},{"$f":"+'5) INPUT COSTI FISSI'!AH22","v":0},{"$f":"+'5) INPUT COSTI FISSI'!AI22","v":0},{"$f":"+'5) INPUT COSTI FISSI'!AJ22","v":0},{"$f":"+'5) INPUT COSTI FISSI'!AK22","v":0},{"$f":"+'5) INPUT COSTI FISSI'!AL22","v":0},{"$f":"+'5) INPUT COSTI FISSI'!AM22","v":0},{"$f":"+'5) INPUT COSTI FISSI'!AN22","v":0},{"$f":"+'5) INPUT COSTI FISSI'!AO22","v":0},{"$f":"+'5) INPUT COSTI FISSI'!AP22","v":0}]
[{"$f":"+'5) INPUT COSTI FISSI'!A23","v":"Cancelleria"},{"$f":"+'5) INPUT COSTI FISSI'!B23","v":100},{"$f":"+'5) INPUT COSTI FISSI'!C23","v":0},{"$f":"+'5) INPUT COSTI FISSI'!D23","v":0},{"$f":"+'5) INPUT COSTI FISSI'!E23","v":0},{"$f":"+'5) INPUT COSTI FISSI'!F23","v":0},{"$f":"+'5) INPUT COSTI FISSI'!G23","v":0},{"$f":"+'5) INPUT COSTI FISSI'!H23","v":0},{"$f":"+'5) INPUT COSTI FISSI'!I23","v":0},{"$f":"+'5) INPUT COSTI FISSI'!J23","v":0},{"$f":"+'5) INPUT COSTI FISSI'!K23","v":0},{"$f":"+'5) INPUT COSTI FISSI'!L23","v":0},{"$f":"+'5) INPUT COSTI FISSI'!M23","v":0},{"$f":"+'5) INPUT COSTI FISSI'!N23","v":100},null,{"$f":"+'5) INPUT COSTI FISSI'!P23","v":100},{"$f":"+'5) INPUT COSTI FISSI'!Q23","v":0},{"$f":"+'5) INPUT COSTI FISSI'!R23","v":0},{"$f":"+'5) INPUT COSTI FISSI'!S23","v":0},{"$f":"+'5) INPUT COSTI FISSI'!T23","v":0},{"$f":"+'5) INPUT COSTI FISSI'!U23","v":0},{"$f":"+'5) INPUT COSTI FISSI'!V23","v":0},{"$f":"+'5) INPUT COSTI FISSI'!W23","v":0},{"$f":"+'5) INPUT COSTI FISSI'!X23","v":0},{"$f":"+'5) INPUT COSTI FISSI'!Y23","v":0},{"$f":"+'5) INPUT COSTI FISSI'!Z23","v":0},{"$f":"+'5) INPUT COSTI FISSI'!AA23","v":0},{"$f":"+'5) INPUT COSTI FISSI'!AB23","v":100},null,{"$f":"+'5) INPUT COSTI FISSI'!AD23","v":100},{"$f":"+'5) INPUT COSTI FISSI'!AE23","v":0},{"$f":"+'5) INPUT COSTI FISSI'!AF23","v":0},{"$f":"+'5) INPUT COSTI FISSI'!AG23","v":0},{"$f":"+'5) INPUT COSTI FISSI'!AH23","v":0},{"$f":"+'5) INPUT COSTI FISSI'!AI23","v":0},{"$f":"+'5) INPUT COSTI FISSI'!AJ23","v":0},{"$f":"+'5) INPUT COSTI FISSI'!AK23","v":0},{"$f":"+'5) INPUT COSTI FISSI'!AL23","v":0},{"$f":"+'5) INPUT COSTI FISSI'!AM23","v":0},{"$f":"+'5) INPUT COSTI FISSI'!AN23","v":0},{"$f":"+'5) INPUT COSTI FISSI'!AO23","v":0},{"$f":"+'5) INPUT COSTI FISSI'!AP23","v":100}]
[{"$f":"+'5) INPUT COSTI FISSI'!A24","v":"Imposta sui rifiuti"},{"$f":"+'5) INPUT COSTI FISSI'!B24","v":0},{"$f":"+'5) INPUT COSTI FISSI'!C24","v":0},{"$f":"+'5) INPUT COSTI FISSI'!D24","v":0},{"$f":"+'5) INPUT COSTI FISSI'!E24","v":0},{"$f":"+'5) INPUT COSTI FISSI'!F24","v":0},{"$f":"+'5) INPUT COSTI FISSI'!G24","v":0},{"$f":"+'5) INPUT COSTI FISSI'!H24","v":0},{"$f":"+'5) INPUT COSTI FISSI'!I24","v":0},{"$f":"+'5) INPUT COSTI FISSI'!J24","v":0},{"$f":"+'5) INPUT COSTI FISSI'!K24","v":0},{"$f":"+'5) INPUT COSTI FISSI'!L24","v":0},{"$f":"+'5) INPUT COSTI FISSI'!M24","v":0},{"$f":"+'5) INPUT COSTI FISSI'!N24","v":0},null,{"$f":"+'5) INPUT COSTI FISSI'!P24","v":0},{"$f":"+'5) INPUT COSTI FISSI'!Q24","v":0},{"$f":"+'5) INPUT COSTI FISSI'!R24","v":0},{"$f":"+'5) INPUT COSTI FISSI'!S24","v":0},{"$f":"+'5) INPUT COSTI FISSI'!T24","v":0},{"$f":"+'5) INPUT COSTI FISSI'!U24","v":0},{"$f":"+'5) INPUT COSTI FISSI'!V24","v":0},{"$f":"+'5) INPUT COSTI FISSI'!W24","v":0},{"$f":"+'5) INPUT COSTI FISSI'!X24","v":0},{"$f":"+'5) INPUT COSTI FISSI'!Y24","v":0},{"$f":"+'5) INPUT COSTI FISSI'!Z24","v":0},{"$f":"+'5) INPUT COSTI FISSI'!AA24","v":0},{"$f":"+'5) INPUT COSTI FISSI'!AB24","v":0},null,{"$f":"+'5) INPUT COSTI FISSI'!AD24","v":0},{"$f":"+'5) INPUT COSTI FISSI'!AE24","v":0},{"$f":"+'5) INPUT COSTI FISSI'!AF24","v":0},{"$f":"+'5) INPUT COSTI FISSI'!AG24","v":0},{"$f":"+'5) INPUT COSTI FISSI'!AH24","v":0},{"$f":"+'5) INPUT COSTI FISSI'!AI24","v":0},{"$f":"+'5) INPUT COSTI FISSI'!AJ24","v":0},{"$f":"+'5) INPUT COSTI FISSI'!AK24","v":0},{"$f":"+'5) INPUT COSTI FISSI'!AL24","v":0},{"$f":"+'5) INPUT COSTI FISSI'!AM24","v":0},{"$f":"+'5) INPUT COSTI FISSI'!AN24","v":0},{"$f":"+'5) INPUT COSTI FISSI'!AO24","v":0},{"$f":"+'5) INPUT COSTI FISSI'!AP24","v":0}]
[{"$f":"+'5) INPUT COSTI FISSI'!A25","v":"Imu"},{"$f":"+'5) INPUT COSTI FISSI'!B25","v":0},{"$f":"+'5) INPUT COSTI FISSI'!C25","v":0},{"$f":"+'5) INPUT COSTI FISSI'!D25","v":0},{"$f":"+'5) INPUT COSTI FISSI'!E25","v":0},{"$f":"+'5) INPUT COSTI FISSI'!F25","v":0},{"$f":"+'5) INPUT COSTI FISSI'!G25","v":0},{"$f":"+'5) INPUT COSTI FISSI'!H25","v":0},{"$f":"+'5) INPUT COSTI FISSI'!I25","v":0},{"$f":"+'5) INPUT COSTI FISSI'!J25","v":0},{"$f":"+'5) INPUT COSTI FISSI'!K25","v":0},{"$f":"+'5) INPUT COSTI FISSI'!L25","v":0},{"$f":"+'5) INPUT COSTI FISSI'!M25","v":0},{"$f":"+'5) INPUT COSTI FISSI'!N25","v":0},null,{"$f":"+'5) INPUT COSTI FISSI'!P25","v":0},{"$f":"+'5) INPUT COSTI FISSI'!Q25","v":0},{"$f":"+'5) INPUT COSTI FISSI'!R25","v":0},{"$f":"+'5) INPUT COSTI FISSI'!S25","v":0},{"$f":"+'5) INPUT COSTI FISSI'!T25","v":0},{"$f":"+'5) INPUT COSTI FISSI'!U25","v":0},{"$f":"+'5) INPUT COSTI FISSI'!V25","v":0},{"$f":"+'5) INPUT COSTI FISSI'!W25","v":0},{"$f":"+'5) INPUT COSTI FISSI'!X25","v":0},{"$f":"+'5) INPUT COSTI FISSI'!Y25","v":0},{"$f":"+'5) INPUT COSTI FISSI'!Z25","v":0},{"$f":"+'5) INPUT COSTI FISSI'!AA25","v":0},{"$f":"+'5) INPUT COSTI FISSI'!AB25","v":0},null,{"$f":"+'5) INPUT COSTI FISSI'!AD25","v":0},{"$f":"+'5) INPUT COSTI FISSI'!AE25","v":0},{"$f":"+'5) INPUT COSTI FISSI'!AF25","v":0},{"$f":"+'5) INPUT COSTI FISSI'!AG25","v":0},{"$f":"+'5) INPUT COSTI FISSI'!AH25","v":0},{"$f":"+'5) INPUT COSTI FISSI'!AI25","v":0},{"$f":"+'5) INPUT COSTI FISSI'!AJ25","v":0},{"$f":"+'5) INPUT COSTI FISSI'!AK25","v":0},{"$f":"+'5) INPUT COSTI FISSI'!AL25","v":0},{"$f":"+'5) INPUT COSTI FISSI'!AM25","v":0},{"$f":"+'5) INPUT COSTI FISSI'!AN25","v":0},{"$f":"+'5) INPUT COSTI FISSI'!AO25","v":0},{"$f":"+'5) INPUT COSTI FISSI'!AP25","v":0}]
[{"$f":"+'5) INPUT COSTI FISSI'!A26","v":"Tasi"},{"$f":"+'5) INPUT COSTI FISSI'!B26","v":0},{"$f":"+'5) INPUT COSTI FISSI'!C26","v":0},{"$f":"+'5) INPUT COSTI FISSI'!D26","v":0},{"$f":"+'5) INPUT COSTI FISSI'!E26","v":0},{"$f":"+'5) INPUT COSTI FISSI'!F26","v":0},{"$f":"+'5) INPUT COSTI FISSI'!G26","v":0},{"$f":"+'5) INPUT COSTI FISSI'!H26","v":0},{"$f":"+'5) INPUT COSTI FISSI'!I26","v":0},{"$f":"+'5) INPUT COSTI FISSI'!J26","v":0},{"$f":"+'5) INPUT COSTI FISSI'!K26","v":0},{"$f":"+'5) INPUT COSTI FISSI'!L26","v":0},{"$f":"+'5) INPUT COSTI FISSI'!M26","v":0},{"$f":"+'5) INPUT COSTI FISSI'!N26","v":0},null,{"$f":"+'5) INPUT COSTI FISSI'!P26","v":0},{"$f":"+'5) INPUT COSTI FISSI'!Q26","v":0},{"$f":"+'5) INPUT COSTI FISSI'!R26","v":0},{"$f":"+'5) INPUT COSTI FISSI'!S26","v":0},{"$f":"+'5) INPUT COSTI FISSI'!T26","v":0},{"$f":"+'5) INPUT COSTI FISSI'!U26","v":0},{"$f":"+'5) INPUT COSTI FISSI'!V26","v":0},{"$f":"+'5) INPUT COSTI FISSI'!W26","v":0},{"$f":"+'5) INPUT COSTI FISSI'!X26","v":0},{"$f":"+'5) INPUT COSTI FISSI'!Y26","v":0},{"$f":"+'5) INPUT COSTI FISSI'!Z26","v":0},{"$f":"+'5) INPUT COSTI FISSI'!AA26","v":0},{"$f":"+'5) INPUT COSTI FISSI'!AB26","v":0},null,{"$f":"+'5) INPUT COSTI FISSI'!AD26","v":0},{"$f":"+'5) INPUT COSTI FISSI'!AE26","v":0},{"$f":"+'5) INPUT COSTI FISSI'!AF26","v":0},{"$f":"+'5) INPUT COSTI FISSI'!AG26","v":0},{"$f":"+'5) INPUT COSTI FISSI'!AH26","v":0},{"$f":"+'5) INPUT COSTI FISSI'!AI26","v":0},{"$f":"+'5) INPUT COSTI FISSI'!AJ26","v":0},{"$f":"+'5) INPUT COSTI FISSI'!AK26","v":0},{"$f":"+'5) INPUT COSTI FISSI'!AL26","v":0},{"$f":"+'5) INPUT COSTI FISSI'!AM26","v":0},{"$f":"+'5) INPUT COSTI FISSI'!AN26","v":0},{"$f":"+'5) INPUT COSTI FISSI'!AO26","v":0},{"$f":"+'5) INPUT COSTI FISSI'!AP26","v":0}]
[{"$f":"+'5) INPUT COSTI FISSI'!A27","v":"Collaborazioni occasionali (stagionali)"},{"$f":"+'5) INPUT COSTI FISSI'!B27","v":0},{"$f":"+'5) INPUT COSTI FISSI'!C27","v":0},{"$f":"+'5) INPUT COSTI FISSI'!D27","v":0},{"$f":"+'5) INPUT COSTI FISSI'!E27","v":0},{"$f":"+'5) INPUT COSTI FISSI'!F27","v":0},{"$f":"+'5) INPUT COSTI FISSI'!G27","v":0},{"$f":"+'5) INPUT COSTI FISSI'!H27","v":0},{"$f":"+'5) INPUT COSTI FISSI'!I27","v":0},{"$f":"+'5) INPUT COSTI FISSI'!J27","v":0},{"$f":"+'5) INPUT COSTI FISSI'!K27","v":0},{"$f":"+'5) INPUT COSTI FISSI'!L27","v":0},{"$f":"+'5) INPUT COSTI FISSI'!M27","v":0},{"$f":"+'5) INPUT COSTI FISSI'!N27","v":0},null,{"$f":"+'5) INPUT COSTI FISSI'!P27","v":0},{"$f":"+'5) INPUT COSTI FISSI'!Q27","v":0},{"$f":"+'5) INPUT COSTI FISSI'!R27","v":0},{"$f":"+'5) INPUT COSTI FISSI'!S27","v":0},{"$f":"+'5) INPUT COSTI FISSI'!T27","v":0},{"$f":"+'5) INPUT COSTI FISSI'!U27","v":0},{"$f":"+'5) INPUT COSTI FISSI'!V27","v":0},{"$f":"+'5) INPUT COSTI FISSI'!W27","v":0},{"$f":"+'5) INPUT COSTI FISSI'!X27","v":0},{"$f":"+'5) INPUT COSTI FISSI'!Y27","v":0},{"$f":"+'5) INPUT COSTI FISSI'!Z27","v":0},{"$f":"+'5) INPUT COSTI FISSI'!AA27","v":0},{"$f":"+'5) INPUT COSTI FISSI'!AB27","v":0},null,{"$f":"+'5) INPUT COSTI FISSI'!AD27","v":0},{"$f":"+'5) INPUT COSTI FISSI'!AE27","v":0},{"$f":"+'5) INPUT COSTI FISSI'!AF27","v":0},{"$f":"+'5) INPUT COSTI FISSI'!AG27","v":0},{"$f":"+'5) INPUT COSTI FISSI'!AH27","v":0},{"$f":"+'5) INPUT COSTI FISSI'!AI27","v":0},{"$f":"+'5) INPUT COSTI FISSI'!AJ27","v":0},{"$f":"+'5) INPUT COSTI FISSI'!AK27","v":0},{"$f":"+'5) INPUT COSTI FISSI'!AL27","v":0},{"$f":"+'5) INPUT COSTI FISSI'!AM27","v":0},{"$f":"+'5) INPUT COSTI FISSI'!AN27","v":0},{"$f":"+'5) INPUT COSTI FISSI'!AO27","v":0},{"$f":"+'5) INPUT COSTI FISSI'!AP27","v":0}]
[{"$f":"+'5) INPUT COSTI FISSI'!A28","v":"Altri costi fissi"},{"$f":"+'5) INPUT COSTI FISSI'!B28","v":0},{"$f":"+'5) INPUT COSTI FISSI'!C28","v":0},{"$f":"+'5) INPUT COSTI FISSI'!D28","v":0},{"$f":"+'5) INPUT COSTI FISSI'!E28","v":0},{"$f":"+'5) INPUT COSTI FISSI'!F28","v":0},{"$f":"+'5) INPUT COSTI FISSI'!G28","v":0},{"$f":"+'5) INPUT COSTI FISSI'!H28","v":0},{"$f":"+'5) INPUT COSTI FISSI'!I28","v":0},{"$f":"+'5) INPUT COSTI FISSI'!J28","v":0},{"$f":"+'5) INPUT COSTI FISSI'!K28","v":0},{"$f":"+'5) INPUT COSTI FISSI'!L28","v":0},{"$f":"+'5) INPUT COSTI FISSI'!M28","v":0},{"$f":"+'5) INPUT COSTI FISSI'!N28","v":0},null,{"$f":"+'5) INPUT COSTI FISSI'!P28","v":0},{"$f":"+'5) INPUT COSTI FISSI'!Q28","v":0},{"$f":"+'5) INPUT COSTI FISSI'!R28","v":0},{"$f":"+'5) INPUT COSTI FISSI'!S28","v":0},{"$f":"+'5) INPUT COSTI FISSI'!T28","v":0},{"$f":"+'5) INPUT COSTI FISSI'!U28","v":0},{"$f":"+'5) INPUT COSTI FISSI'!V28","v":0},{"$f":"+'5) INPUT COSTI FISSI'!W28","v":0},{"$f":"+'5) INPUT COSTI FISSI'!X28","v":0},{"$f":"+'5) INPUT COSTI FISSI'!Y28","v":0},{"$f":"+'5) INPUT COSTI FISSI'!Z28","v":0},{"$f":"+'5) INPUT COSTI FISSI'!AA28","v":0},{"$f":"+'5) INPUT COSTI FISSI'!AB28","v":0},null,{"$f":"+'5) INPUT COSTI FISSI'!AD28","v":0},{"$f":"+'5) INPUT COSTI FISSI'!AE28","v":0},{"$f":"+'5) INPUT COSTI FISSI'!AF28","v":0},{"$f":"+'5) INPUT COSTI FISSI'!AG28","v":0},{"$f":"+'5) INPUT COSTI FISSI'!AH28","v":0},{"$f":"+'5) INPUT COSTI FISSI'!AI28","v":0},{"$f":"+'5) INPUT COSTI FISSI'!AJ28","v":0},{"$f":"+'5) INPUT COSTI FISSI'!AK28","v":0},{"$f":"+'5) INPUT COSTI FISSI'!AL28","v":0},{"$f":"+'5) INPUT COSTI FISSI'!AM28","v":0},{"$f":"+'5) INPUT COSTI FISSI'!AN28","v":0},{"$f":"+'5) INPUT COSTI FISSI'!AO28","v":0},{"$f":"+'5) INPUT COSTI FISSI'!AP28","v":0}]
[{"$f":"+'5) INPUT COSTI FISSI'!A29","v":"Altri costi fissi"},{"$f":"+'5) INPUT COSTI FISSI'!B29","v":0},{"$f":"+'5) INPUT COSTI FISSI'!C29","v":0},{"$f":"+'5) INPUT COSTI FISSI'!D29","v":0},{"$f":"+'5) INPUT COSTI FISSI'!E29","v":0},{"$f":"+'5) INPUT COSTI FISSI'!F29","v":0},{"$f":"+'5) INPUT COSTI FISSI'!G29","v":0},{"$f":"+'5) INPUT COSTI FISSI'!H29","v":0},{"$f":"+'5) INPUT COSTI FISSI'!I29","v":0},{"$f":"+'5) INPUT COSTI FISSI'!J29","v":0},{"$f":"+'5) INPUT COSTI FISSI'!K29","v":0},{"$f":"+'5) INPUT COSTI FISSI'!L29","v":0},{"$f":"+'5) INPUT COSTI FISSI'!M29","v":0},{"$f":"+'5) INPUT COSTI FISSI'!N29","v":0},null,{"$f":"+'5) INPUT COSTI FISSI'!P29","v":0},{"$f":"+'5) INPUT COSTI FISSI'!Q29","v":0},{"$f":"+'5) INPUT COSTI FISSI'!R29","v":0},{"$f":"+'5) INPUT COSTI FISSI'!S29","v":0},{"$f":"+'5) INPUT COSTI FISSI'!T29","v":0},{"$f":"+'5) INPUT COSTI FISSI'!U29","v":0},{"$f":"+'5) INPUT COSTI FISSI'!V29","v":0},{"$f":"+'5) INPUT COSTI FISSI'!W29","v":0},{"$f":"+'5) INPUT COSTI FISSI'!X29","v":0},{"$f":"+'5) INPUT COSTI FISSI'!Y29","v":0},{"$f":"+'5) INPUT COSTI FISSI'!Z29","v":0},{"$f":"+'5) INPUT COSTI FISSI'!AA29","v":0},{"$f":"+'5) INPUT COSTI FISSI'!AB29","v":0},null,{"$f":"+'5) INPUT COSTI FISSI'!AD29","v":0},{"$f":"+'5) INPUT COSTI FISSI'!AE29","v":0},{"$f":"+'5) INPUT COSTI FISSI'!AF29","v":0},{"$f":"+'5) INPUT COSTI FISSI'!AG29","v":0},{"$f":"+'5) INPUT COSTI FISSI'!AH29","v":0},{"$f":"+'5) INPUT COSTI FISSI'!AI29","v":0},{"$f":"+'5) INPUT COSTI FISSI'!AJ29","v":0},{"$f":"+'5) INPUT COSTI FISSI'!AK29","v":0},{"$f":"+'5) INPUT COSTI FISSI'!AL29","v":0},{"$f":"+'5) INPUT COSTI FISSI'!AM29","v":0},{"$f":"+'5) INPUT COSTI FISSI'!AN29","v":0},{"$f":"+'5) INPUT COSTI FISSI'!AO29","v":0},{"$f":"+'5) INPUT COSTI FISSI'!AP29","v":0}]
[{"$f":"+'5) INPUT COSTI FISSI'!A30","v":"Altri costi fissi"},{"$f":"+'5) INPUT COSTI FISSI'!B30","v":0},{"$f":"+'5) INPUT COSTI FISSI'!C30","v":0},{"$f":"+'5) INPUT COSTI FISSI'!D30","v":0},{"$f":"+'5) INPUT COSTI FISSI'!E30","v":0},{"$f":"+'5) INPUT COSTI FISSI'!F30","v":0},{"$f":"+'5) INPUT COSTI FISSI'!G30","v":0},{"$f":"+'5) INPUT COSTI FISSI'!H30","v":0},{"$f":"+'5) INPUT COSTI FISSI'!I30","v":0},{"$f":"+'5) INPUT COSTI FISSI'!J30","v":0},{"$f":"+'5) INPUT COSTI FISSI'!K30","v":0},{"$f":"+'5) INPUT COSTI FISSI'!L30","v":0},{"$f":"+'5) INPUT COSTI FISSI'!M30","v":0},{"$f":"+'5) INPUT COSTI FISSI'!N30","v":0},null,{"$f":"+'5) INPUT COSTI FISSI'!P30","v":0},{"$f":"+'5) INPUT COSTI FISSI'!Q30","v":0},{"$f":"+'5) INPUT COSTI FISSI'!R30","v":0},{"$f":"+'5) INPUT COSTI FISSI'!S30","v":0},{"$f":"+'5) INPUT COSTI FISSI'!T30","v":0},{"$f":"+'5) INPUT COSTI FISSI'!U30","v":0},{"$f":"+'5) INPUT COSTI FISSI'!V30","v":0},{"$f":"+'5) INPUT COSTI FISSI'!W30","v":0},{"$f":"+'5) INPUT COSTI FISSI'!X30","v":0},{"$f":"+'5) INPUT COSTI FISSI'!Y30","v":0},{"$f":"+'5) INPUT COSTI FISSI'!Z30","v":0},{"$f":"+'5) INPUT COSTI FISSI'!AA30","v":0},{"$f":"+'5) INPUT COSTI FISSI'!AB30","v":0},null,{"$f":"+'5) INPUT COSTI FISSI'!AD30","v":0},{"$f":"+'5) INPUT COSTI FISSI'!AE30","v":0},{"$f":"+'5) INPUT COSTI FISSI'!AF30","v":0},{"$f":"+'5) INPUT COSTI FISSI'!AG30","v":0},{"$f":"+'5) INPUT COSTI FISSI'!AH30","v":0},{"$f":"+'5) INPUT COSTI FISSI'!AI30","v":0},{"$f":"+'5) INPUT COSTI FISSI'!AJ30","v":0},{"$f":"+'5) INPUT COSTI FISSI'!AK30","v":0},{"$f":"+'5) INPUT COSTI FISSI'!AL30","v":0},{"$f":"+'5) INPUT COSTI FISSI'!AM30","v":0},{"$f":"+'5) INPUT COSTI FISSI'!AN30","v":0},{"$f":"+'5) INPUT COSTI FISSI'!AO30","v":0},{"$f":"+'5) INPUT COSTI FISSI'!AP30","v":0}]
[{"$f":"+'5) INPUT COSTI FISSI'!A31","v":"Altri costi fissi"},{"$f":"+'5) INPUT COSTI FISSI'!B31","v":0},{"$f":"+'5) INPUT COSTI FISSI'!C31","v":0},{"$f":"+'5) INPUT COSTI FISSI'!D31","v":0},{"$f":"+'5) INPUT COSTI FISSI'!E31","v":0},{"$f":"+'5) INPUT COSTI FISSI'!F31","v":0},{"$f":"+'5) INPUT COSTI FISSI'!G31","v":0},{"$f":"+'5) INPUT COSTI FISSI'!H31","v":0},{"$f":"+'5) INPUT COSTI FISSI'!I31","v":0},{"$f":"+'5) INPUT COSTI FISSI'!J31","v":0},{"$f":"+'5) INPUT COSTI FISSI'!K31","v":0},{"$f":"+'5) INPUT COSTI FISSI'!L31","v":0},{"$f":"+'5) INPUT COSTI FISSI'!M31","v":0},{"$f":"+'5) INPUT COSTI FISSI'!N31","v":0},null,{"$f":"+'5) INPUT COSTI FISSI'!P31","v":0},{"$f":"+'5) INPUT COSTI FISSI'!Q31","v":0},{"$f":"+'5) INPUT COSTI FISSI'!R31","v":0},{"$f":"+'5) INPUT COSTI FISSI'!S31","v":0},{"$f":"+'5) INPUT COSTI FISSI'!T31","v":0},{"$f":"+'5) INPUT COSTI FISSI'!U31","v":0},{"$f":"+'5) INPUT COSTI FISSI'!V31","v":0},{"$f":"+'5) INPUT COSTI FISSI'!W31","v":0},{"$f":"+'5) INPUT COSTI FISSI'!X31","v":0},{"$f":"+'5) INPUT COSTI FISSI'!Y31","v":0},{"$f":"+'5) INPUT COSTI FISSI'!Z31","v":0},{"$f":"+'5) INPUT COSTI FISSI'!AA31","v":0},{"$f":"+'5) INPUT COSTI FISSI'!AB31","v":0},null,{"$f":"+'5) INPUT COSTI FISSI'!AD31","v":0},{"$f":"+'5) INPUT COSTI FISSI'!AE31","v":0},{"$f":"+'5) INPUT COSTI FISSI'!AF31","v":0},{"$f":"+'5) INPUT COSTI FISSI'!AG31","v":0},{"$f":"+'5) INPUT COSTI FISSI'!AH31","v":0},{"$f":"+'5) INPUT COSTI FISSI'!AI31","v":0},{"$f":"+'5) INPUT COSTI FISSI'!AJ31","v":0},{"$f":"+'5) INPUT COSTI FISSI'!AK31","v":0},{"$f":"+'5) INPUT COSTI FISSI'!AL31","v":0},{"$f":"+'5) INPUT COSTI FISSI'!AM31","v":0},{"$f":"+'5) INPUT COSTI FISSI'!AN31","v":0},{"$f":"+'5) INPUT COSTI FISSI'!AO31","v":0},{"$f":"+'5) INPUT COSTI FISSI'!AP31","v":0}]
[{"$f":"+'5) INPUT COSTI FISSI'!A32","v":"Altri costi fissi"},{"$f":"+'5) INPUT COSTI FISSI'!B32","v":0},{"$f":"+'5) INPUT COSTI FISSI'!C32","v":0},{"$f":"+'5) INPUT COSTI FISSI'!D32","v":0},{"$f":"+'5) INPUT COSTI FISSI'!E32","v":0},{"$f":"+'5) INPUT COSTI FISSI'!F32","v":0},{"$f":"+'5) INPUT COSTI FISSI'!G32","v":0},{"$f":"+'5) INPUT COSTI FISSI'!H32","v":0},{"$f":"+'5) INPUT COSTI FISSI'!I32","v":0},{"$f":"+'5) INPUT COSTI FISSI'!J32","v":0},{"$f":"+'5) INPUT COSTI FISSI'!K32","v":0},{"$f":"+'5) INPUT COSTI FISSI'!L32","v":0},{"$f":"+'5) INPUT COSTI FISSI'!M32","v":0},{"$f":"+'5) INPUT COSTI FISSI'!N32","v":0},null,{"$f":"+'5) INPUT COSTI FISSI'!P32","v":0},{"$f":"+'5) INPUT COSTI FISSI'!Q32","v":0},{"$f":"+'5) INPUT COSTI FISSI'!R32","v":0},{"$f":"+'5) INPUT COSTI FISSI'!S32","v":0},{"$f":"+'5) INPUT COSTI FISSI'!T32","v":0},{"$f":"+'5) INPUT COSTI FISSI'!U32","v":0},{"$f":"+'5) INPUT COSTI FISSI'!V32","v":0},{"$f":"+'5) INPUT COSTI FISSI'!W32","v":0},{"$f":"+'5) INPUT COSTI FISSI'!X32","v":0},{"$f":"+'5) INPUT COSTI FISSI'!Y32","v":0},{"$f":"+'5) INPUT COSTI FISSI'!Z32","v":0},{"$f":"+'5) INPUT COSTI FISSI'!AA32","v":0},{"$f":"+'5) INPUT COSTI FISSI'!AB32","v":0},null,{"$f":"+'5) INPUT COSTI FISSI'!AD32","v":0},{"$f":"+'5) INPUT COSTI FISSI'!AE32","v":0},{"$f":"+'5) INPUT COSTI FISSI'!AF32","v":0},{"$f":"+'5) INPUT COSTI FISSI'!AG32","v":0},{"$f":"+'5) INPUT COSTI FISSI'!AH32","v":0},{"$f":"+'5) INPUT COSTI FISSI'!AI32","v":0},{"$f":"+'5) INPUT COSTI FISSI'!AJ32","v":0},{"$f":"+'5) INPUT COSTI FISSI'!AK32","v":0},{"$f":"+'5) INPUT COSTI FISSI'!AL32","v":0},{"$f":"+'5) INPUT COSTI FISSI'!AM32","v":0},{"$f":"+'5) INPUT COSTI FISSI'!AN32","v":0},{"$f":"+'5) INPUT COSTI FISSI'!AO32","v":0},{"$f":"+'5) INPUT COSTI FISSI'!AP32","v":0}]
[{"$f":"+'5) INPUT COSTI FISSI'!A33","v":"Altri costi fissi"},{"$f":"+'5) INPUT COSTI FISSI'!B33","v":0},{"$f":"+'5) INPUT COSTI FISSI'!C33","v":0},{"$f":"+'5) INPUT COSTI FISSI'!D33","v":0},{"$f":"+'5) INPUT COSTI FISSI'!E33","v":0},{"$f":"+'5) INPUT COSTI FISSI'!F33","v":0},{"$f":"+'5) INPUT COSTI FISSI'!G33","v":0},{"$f":"+'5) INPUT COSTI FISSI'!H33","v":0},{"$f":"+'5) INPUT COSTI FISSI'!I33","v":0},{"$f":"+'5) INPUT COSTI FISSI'!J33","v":0},{"$f":"+'5) INPUT COSTI FISSI'!K33","v":0},{"$f":"+'5) INPUT COSTI FISSI'!L33","v":0},{"$f":"+'5) INPUT COSTI FISSI'!M33","v":0},{"$f":"+'5) INPUT COSTI FISSI'!N33","v":0},null,{"$f":"+'5) INPUT COSTI FISSI'!P33","v":0},{"$f":"+'5) INPUT COSTI FISSI'!Q33","v":0},{"$f":"+'5) INPUT COSTI FISSI'!R33","v":0},{"$f":"+'5) INPUT COSTI FISSI'!S33","v":0},{"$f":"+'5) INPUT COSTI FISSI'!T33","v":0},{"$f":"+'5) INPUT COSTI FISSI'!U33","v":0},{"$f":"+'5) INPUT COSTI FISSI'!V33","v":0},{"$f":"+'5) INPUT COSTI FISSI'!W33","v":0},{"$f":"+'5) INPUT COSTI FISSI'!X33","v":0},{"$f":"+'5) INPUT COSTI FISSI'!Y33","v":0},{"$f":"+'5) INPUT COSTI FISSI'!Z33","v":0},{"$f":"+'5) INPUT COSTI FISSI'!AA33","v":0},{"$f":"+'5) INPUT COSTI FISSI'!AB33","v":0},null,{"$f":"+'5) INPUT COSTI FISSI'!AD33","v":0},{"$f":"+'5) INPUT COSTI FISSI'!AE33","v":0},{"$f":"+'5) INPUT COSTI FISSI'!AF33","v":0},{"$f":"+'5) INPUT COSTI FISSI'!AG33","v":0},{"$f":"+'5) INPUT COSTI FISSI'!AH33","v":0},{"$f":"+'5) INPUT COSTI FISSI'!AI33","v":0},{"$f":"+'5) INPUT COSTI FISSI'!AJ33","v":0},{"$f":"+'5) INPUT COSTI FISSI'!AK33","v":0},{"$f":"+'5) INPUT COSTI FISSI'!AL33","v":0},{"$f":"+'5) INPUT COSTI FISSI'!AM33","v":0},{"$f":"+'5) INPUT COSTI FISSI'!AN33","v":0},{"$f":"+'5) INPUT COSTI FISSI'!AO33","v":0},{"$f":"+'5) INPUT COSTI FISSI'!AP33","v":0}]
[{"$f":"+'5) INPUT COSTI FISSI'!A34","v":"Altri costi fissi"},{"$f":"+'5) INPUT COSTI FISSI'!B34","v":0},{"$f":"+'5) INPUT COSTI FISSI'!C34","v":0},{"$f":"+'5) INPUT COSTI FISSI'!D34","v":0},{"$f":"+'5) INPUT COSTI FISSI'!E34","v":0},{"$f":"+'5) INPUT COSTI FISSI'!F34","v":0},{"$f":"+'5) INPUT COSTI FISSI'!G34","v":0},{"$f":"+'5) INPUT COSTI FISSI'!H34","v":0},{"$f":"+'5) INPUT COSTI FISSI'!I34","v":0},{"$f":"+'5) INPUT COSTI FISSI'!J34","v":0},{"$f":"+'5) INPUT COSTI FISSI'!K34","v":0},{"$f":"+'5) INPUT COSTI FISSI'!L34","v":0},{"$f":"+'5) INPUT COSTI FISSI'!M34","v":0},{"$f":"+'5) INPUT COSTI FISSI'!N34","v":0},null,{"$f":"+'5) INPUT COSTI FISSI'!P34","v":0},{"$f":"+'5) INPUT COSTI FISSI'!Q34","v":0},{"$f":"+'5) INPUT COSTI FISSI'!R34","v":0},{"$f":"+'5) INPUT COSTI FISSI'!S34","v":0},{"$f":"+'5) INPUT COSTI FISSI'!T34","v":0},{"$f":"+'5) INPUT COSTI FISSI'!U34","v":0},{"$f":"+'5) INPUT COSTI FISSI'!V34","v":0},{"$f":"+'5) INPUT COSTI FISSI'!W34","v":0},{"$f":"+'5) INPUT COSTI FISSI'!X34","v":0},{"$f":"+'5) INPUT COSTI FISSI'!Y34","v":0},{"$f":"+'5) INPUT COSTI FISSI'!Z34","v":0},{"$f":"+'5) INPUT COSTI FISSI'!AA34","v":0},{"$f":"+'5) INPUT COSTI FISSI'!AB34","v":0},null,{"$f":"+'5) INPUT COSTI FISSI'!AD34","v":0},{"$f":"+'5) INPUT COSTI FISSI'!AE34","v":0},{"$f":"+'5) INPUT COSTI FISSI'!AF34","v":0},{"$f":"+'5) INPUT COSTI FISSI'!AG34","v":0},{"$f":"+'5) INPUT COSTI FISSI'!AH34","v":0},{"$f":"+'5) INPUT COSTI FISSI'!AI34","v":0},{"$f":"+'5) INPUT COSTI FISSI'!AJ34","v":0},{"$f":"+'5) INPUT COSTI FISSI'!AK34","v":0},{"$f":"+'5) INPUT COSTI FISSI'!AL34","v":0},{"$f":"+'5) INPUT COSTI FISSI'!AM34","v":0},{"$f":"+'5) INPUT COSTI FISSI'!AN34","v":0},{"$f":"+'5) INPUT COSTI FISSI'!AO34","v":0},{"$f":"+'5) INPUT COSTI FISSI'!AP34","v":0}]
[{"$f":"+'5) INPUT COSTI FISSI'!A35","v":"Altri costi fissi"},{"$f":"+'5) INPUT COSTI FISSI'!B35","v":0},{"$f":"+'5) INPUT COSTI FISSI'!C35","v":0},{"$f":"+'5) INPUT COSTI FISSI'!D35","v":0},{"$f":"+'5) INPUT COSTI FISSI'!E35","v":0},{"$f":"+'5) INPUT COSTI FISSI'!F35","v":0},{"$f":"+'5) INPUT COSTI FISSI'!G35","v":0},{"$f":"+'5) INPUT COSTI FISSI'!H35","v":0},{"$f":"+'5) INPUT COSTI FISSI'!I35","v":0},{"$f":"+'5) INPUT COSTI FISSI'!J35","v":0},{"$f":"+'5) INPUT COSTI FISSI'!K35","v":0},{"$f":"+'5) INPUT COSTI FISSI'!L35","v":0},{"$f":"+'5) INPUT COSTI FISSI'!M35","v":0},{"$f":"+'5) INPUT COSTI FISSI'!N35","v":0},null,{"$f":"+'5) INPUT COSTI FISSI'!P35","v":0},{"$f":"+'5) INPUT COSTI FISSI'!Q35","v":0},{"$f":"+'5) INPUT COSTI FISSI'!R35","v":0},{"$f":"+'5) INPUT COSTI FISSI'!S35","v":0},{"$f":"+'5) INPUT COSTI FISSI'!T35","v":0},{"$f":"+'5) INPUT COSTI FISSI'!U35","v":0},{"$f":"+'5) INPUT COSTI FISSI'!V35","v":0},{"$f":"+'5) INPUT COSTI FISSI'!W35","v":0},{"$f":"+'5) INPUT COSTI FISSI'!X35","v":0},{"$f":"+'5) INPUT COSTI FISSI'!Y35","v":0},{"$f":"+'5) INPUT COSTI FISSI'!Z35","v":0},{"$f":"+'5) INPUT COSTI FISSI'!AA35","v":0},{"$f":"+'5) INPUT COSTI FISSI'!AB35","v":0},null,{"$f":"+'5) INPUT COSTI FISSI'!AD35","v":0},{"$f":"+'5) INPUT COSTI FISSI'!AE35","v":0},{"$f":"+'5) INPUT COSTI FISSI'!AF35","v":0},{"$f":"+'5) INPUT COSTI FISSI'!AG35","v":0},{"$f":"+'5) INPUT COSTI FISSI'!AH35","v":0},{"$f":"+'5) INPUT COSTI FISSI'!AI35","v":0},{"$f":"+'5) INPUT COSTI FISSI'!AJ35","v":0},{"$f":"+'5) INPUT COSTI FISSI'!AK35","v":0},{"$f":"+'5) INPUT COSTI FISSI'!AL35","v":0},{"$f":"+'5) INPUT COSTI FISSI'!AM35","v":0},{"$f":"+'5) INPUT COSTI FISSI'!AN35","v":0},{"$f":"+'5) INPUT COSTI FISSI'!AO35","v":0},{"$f":"+'5) INPUT COSTI FISSI'!AP35","v":0}]
["RATA FINANZIAMENTO",{"$f":"IF($A$123=\"LEVERED\",_xlfn.IFNA(VLOOKUP(B4,'7) INPUT FINANZIAMENTO'!$A$27:$K$387,5,FALSE),0),0)","v":0},{"$f":"IF($A$123=\"LEVERED\",_xlfn.IFNA(VLOOKUP(C4,'7) INPUT FINANZIAMENTO'!$A$27:$K$387,5,FALSE),0),0)","v":0},{"$f":"IF($A$123=\"LEVERED\",_xlfn.IFNA(VLOOKUP(D4,'7) INPUT FINANZIAMENTO'!$A$27:$K$387,5,FALSE),0),0)","v":0},{"$f":"IF($A$123=\"LEVERED\",_xlfn.IFNA(VLOOKUP(E4,'7) INPUT FINANZIAMENTO'!$A$27:$K$387,5,FALSE),0),0)","v":0},{"$f":"IF($A$123=\"LEVERED\",_xlfn.IFNA(VLOOKUP(F4,'7) INPUT FINANZIAMENTO'!$A$27:$K$387,5,FALSE),0),0)","v":0},{"$f":"IF($A$123=\"LEVERED\",_xlfn.IFNA(VLOOKUP(G4,'7) INPUT FINANZIAMENTO'!$A$27:$K$387,5,FALSE),0),0)","v":0},{"$f":"IF($A$123=\"LEVERED\",_xlfn.IFNA(VLOOKUP(H4,'7) INPUT FINANZIAMENTO'!$A$27:$K$387,5,FALSE),0),0)","v":0},{"$f":"IF($A$123=\"LEVERED\",_xlfn.IFNA(VLOOKUP(I4,'7) INPUT FINANZIAMENTO'!$A$27:$K$387,5,FALSE),0),0)","v":0},{"$f":"IF($A$123=\"LEVERED\",_xlfn.IFNA(VLOOKUP(J4,'7) INPUT FINANZIAMENTO'!$A$27:$K$387,5,FALSE),0),0)","v":0},{"$f":"IF($A$123=\"LEVERED\",_xlfn.IFNA(VLOOKUP(K4,'7) INPUT FINANZIAMENTO'!$A$27:$K$387,5,FALSE),0),0)","v":0},{"$f":"IF($A$123=\"LEVERED\",_xlfn.IFNA(VLOOKUP(L4,'7) INPUT FINANZIAMENTO'!$A$27:$K$387,5,FALSE),0),0)","v":0},{"$f":"IF($A$123=\"LEVERED\",_xlfn.IFNA(VLOOKUP(M4,'7) INPUT FINANZIAMENTO'!$A$27:$K$387,5,FALSE),0),0)","v":0},{"$f":"SUM(B105:M105)","v":0},null,{"$f":"IF($A$123=\"LEVERED\",_xlfn.IFNA(VLOOKUP(P4,'7) INPUT FINANZIAMENTO'!$A$27:$K$387,5,FALSE),0),0)","v":0},{"$f":"IF($A$123=\"LEVERED\",_xlfn.IFNA(VLOOKUP(Q4,'7) INPUT FINANZIAMENTO'!$A$27:$K$387,5,FALSE),0),0)","v":0},{"$f":"IF($A$123=\"LEVERED\",_xlfn.IFNA(VLOOKUP(R4,'7) INPUT FINANZIAMENTO'!$A$27:$K$387,5,FALSE),0),0)","v":0},{"$f":"IF($A$123=\"LEVERED\",_xlfn.IFNA(VLOOKUP(S4,'7) INPUT FINANZIAMENTO'!$A$27:$K$387,5,FALSE),0),0)","v":0},{"$f":"IF($A$123=\"LEVERED\",_xlfn.IFNA(VLOOKUP(T4,'7) INPUT FINANZIAMENTO'!$A$27:$K$387,5,FALSE),0),0)","v":0},{"$f":"IF($A$123=\"LEVERED\",_xlfn.IFNA(VLOOKUP(U4,'7) INPUT FINANZIAMENTO'!$A$27:$K$387,5,FALSE),0),0)","v":0},{"$f":"IF($A$123=\"LEVERED\",_xlfn.IFNA(VLOOKUP(V4,'7) INPUT FINANZIAMENTO'!$A$27:$K$387,5,FALSE),0),0)","v":0},{"$f":"IF($A$123=\"LEVERED\",_xlfn.IFNA(VLOOKUP(W4,'7) INPUT FINANZIAMENTO'!$A$27:$K$387,5,FALSE),0),0)","v":0},{"$f":"IF($A$123=\"LEVERED\",_xlfn.IFNA(VLOOKUP(X4,'7) INPUT FINANZIAMENTO'!$A$27:$K$387,5,FALSE),0),0)","v":0},{"$f":"IF($A$123=\"LEVERED\",_xlfn.IFNA(VLOOKUP(Y4,'7) INPUT FINANZIAMENTO'!$A$27:$K$387,5,FALSE),0),0)","v":0},{"$f":"IF($A$123=\"LEVERED\",_xlfn.IFNA(VLOOKUP(Z4,'7) INPUT FINANZIAMENTO'!$A$27:$K$387,5,FALSE),0),0)","v":0},{"$f":"IF($A$123=\"LEVERED\",_xlfn.IFNA(VLOOKUP(AA4,'7) INPUT FINANZIAMENTO'!$A$27:$K$387,5,FALSE),0),0)","v":0},{"$f":"SUM(P105:AA105)","v":0},null,{"$f":"IF($A$123=\"LEVERED\",_xlfn.IFNA(VLOOKUP(AD4,'7) INPUT FINANZIAMENTO'!$A$27:$K$387,5,FALSE),0),0)","v":0},{"$f":"IF($A$123=\"LEVERED\",_xlfn.IFNA(VLOOKUP(AE4,'7) INPUT FINANZIAMENTO'!$A$27:$K$387,5,FALSE),0),0)","v":0},{"$f":"IF($A$123=\"LEVERED\",_xlfn.IFNA(VLOOKUP(AF4,'7) INPUT FINANZIAMENTO'!$A$27:$K$387,5,FALSE),0),0)","v":0},{"$f":"IF($A$123=\"LEVERED\",_xlfn.IFNA(VLOOKUP(AG4,'7) INPUT FINANZIAMENTO'!$A$27:$K$387,5,FALSE),0),0)","v":0},{"$f":"IF($A$123=\"LEVERED\",_xlfn.IFNA(VLOOKUP(AH4,'7) INPUT FINANZIAMENTO'!$A$27:$K$387,5,FALSE),0),0)","v":0},{"$f":"IF($A$123=\"LEVERED\",_xlfn.IFNA(VLOOKUP(AI4,'7) INPUT FINANZIAMENTO'!$A$27:$K$387,5,FALSE),0),0)","v":0},{"$f":"IF($A$123=\"LEVERED\",_xlfn.IFNA(VLOOKUP(AJ4,'7) INPUT FINANZIAMENTO'!$A$27:$K$387,5,FALSE),0),0)","v":0},{"$f":"IF($A$123=\"LEVERED\",_xlfn.IFNA(VLOOKUP(AK4,'7) INPUT FINANZIAMENTO'!$A$27:$K$387,5,FALSE),0),0)","v":0},{"$f":"IF($A$123=\"LEVERED\",_xlfn.IFNA(VLOOKUP(AL4,'7) INPUT FINANZIAMENTO'!$A$27:$K$387,5,FALSE),0),0)","v":0},{"$f":"IF($A$123=\"LEVERED\",_xlfn.IFNA(VLOOKUP(AM4,'7) INPUT FINANZIAMENTO'!$A$27:$K$387,5,FALSE),0),0)","v":0},{"$f":"IF($A$123=\"LEVERED\",_xlfn.IFNA(VLOOKUP(AN4,'7) INPUT FINANZIAMENTO'!$A$27:$K$387,5,FALSE),0),0)","v":0},{"$f":"IF($A$123=\"LEVERED\",_xlfn.IFNA(VLOOKUP(AO4,'7) INPUT FINANZIAMENTO'!$A$27:$K$387,5,FALSE),0),0)","v":0},{"$f":"SUM(AD105:AO105)","v":0}]
["USCITE FISSE",{"$f":"SUM(B72:B105)","v":530},{"$f":"SUM(C72:C105)","v":390},{"$f":"SUM(D72:D105)","v":230},440,230,390,280,390,230,440,230,1140,4920,null,530,390,230,440,230,390,280,390,230,440,230,1140,4920,null,530,390,230,440,230,390,280,390,230,440,230,1140,4920]
[]
[null,{"$f":"+B71","v":"2016-04-30"},{"$f":"+C71","v":"2016-05-31"},"2016-06-30","2016-07-31","2016-08-31","2016-09-30","2016-10-31","2016-11-30","2016-12-31","2017-01-31","2017-02-28","2017-03-31","TOTALE",null,"2017-04-30","2017-05-31","2017-06-30","2017-07-31","2017-08-31","2017-09-30","2017-10-31","2017-11-30","2017-12-31","2018-01-31","2018-02-28","2018-03-31","TOTALE",null,"2018-04-30","2018-05-31","2018-06-30","2018-07-31","2018-08-31","2018-09-30","2018-10-31","2018-11-30","2018-12-31","2019-01-31","2019-02-28","2019-03-31","TOTALE"]
[{"$f":"+'6) INPUT COSTI VARIABILI'!B40","v":"Materie prime colazione"},{"$f":"+'6) INPUT COSTI VARIABILI'!C40","v":36},{"$f":"+'6) INPUT COSTI VARIABILI'!D40","v":93},{"$f":"+'6) INPUT COSTI VARIABILI'!E40","v":162},{"$f":"+'6) INPUT COSTI VARIABILI'!F40","v":167.4},{"$f":"+'6) INPUT COSTI VARIABILI'!G40","v":167.4},{"$f":"+'6) INPUT COSTI VARIABILI'!H40","v":90},{"$f":"+'6) INPUT COSTI VARIABILI'!I40","v":37.200000000000003},{"$f":"+'6) INPUT COSTI VARIABILI'!J40","v":36},{"$f":"+'6) INPUT COSTI VARIABILI'!K40","v":167.4},{"$f":"+'6) INPUT COSTI VARIABILI'!L40","v":37.200000000000003},{"$f":"+'6) INPUT COSTI VARIABILI'!M40","v":33.6},{"$f":"+'6) INPUT COSTI VARIABILI'!N40","v":37.200000000000003},{"$f":"SUM(B109:M109)","v":1064.4000000000001},null,{"$f":"+'6) INPUT COSTI VARIABILI'!R40","v":36},{"$f":"+'6) INPUT COSTI VARIABILI'!S40","v":93},{"$f":"+'6) INPUT COSTI VARIABILI'!T40","v":162},{"$f":"+'6) INPUT COSTI VARIABILI'!U40","v":167.4},{"$f":"+'6) INPUT COSTI VARIABILI'!V40","v":167.4},{"$f":"+'6) INPUT COSTI VARIABILI'!W40","v":90},{"$f":"+'6) INPUT COSTI VARIABILI'!X40","v":37.200000000000003},{"$f":"+'6) INPUT COSTI VARIABILI'!Y40","v":36},{"$f":"+'6) INPUT COSTI VARIABILI'!Z40","v":167.4},{"$f":"+'6) INPUT COSTI VARIABILI'!AA40","v":37.200000000000003},{"$f":"+'6) INPUT COSTI VARIABILI'!AB40","v":33.6},{"$f":"+'6) INPUT COSTI VARIABILI'!AC40","v":37.200000000000003},{"$f":"SUM(P109:AA109)","v":1064.4000000000001},null,{"$f":"+'6) INPUT COSTI VARIABILI'!AG40","v":36},{"$f":"+'6) INPUT COSTI VARIABILI'!AH40","v":93},{"$f":"+'6) INPUT COSTI VARIABILI'!AI40","v":162},{"$f":"+'6) INPUT COSTI VARIABILI'!AJ40","v":167.4},{"$f":"+'6) INPUT COSTI VARIABILI'!AK40","v":167.4},{"$f":"+'6) INPUT COSTI VARIABILI'!AL40","v":90},{"$f":"+'6) INPUT COSTI VARIABILI'!AM40","v":37.200000000000003},{"$f":"+'6) INPUT COSTI VARIABILI'!AN40","v":36},{"$f":"+'6) INPUT COSTI VARIABILI'!AO40","v":167.4},{"$f":"+'6) INPUT COSTI VARIABILI'!AP40","v":37.200000000000003},{"$f":"+'6) INPUT COSTI VARIABILI'!AQ40","v":33.6},{"$f":"+'6) INPUT COSTI VARIABILI'!AR40","v":37.200000000000003},{"$f":"SUM(AD109:AO109)","v":1064.4000000000001}]
[{"$f":"+'6) INPUT COSTI VARIABILI'!B41","v":"Materiale di consumo ospiti"},{"$f":"+'6) INPUT COSTI VARIABILI'!C41","v":6},{"$f":"+'6) INPUT COSTI VARIABILI'!D41","v":21.7},{"$f":"+'6) INPUT COSTI VARIABILI'!E41","v":48.6},{"$f":"+'6) INPUT COSTI VARIABILI'!F41","v":50.22},{"$f":"+'6) INPUT COSTI VARIABILI'!G41","v":50.22},{"$f":"+'6) INPUT COSTI VARIABILI'!H41","v":21},{"$f":"+'6) INPUT COSTI VARIABILI'!I41","v":6.2},{"$f":"+'6) INPUT COSTI VARIABILI'!J41","v":6},{"$f":"+'6) INPUT COSTI VARIABILI'!K41","v":50.22},{"$f":"+'6) INPUT COSTI VARIABILI'!L41","v":6.2},{"$f":"+'6) INPUT COSTI VARIABILI'!M41","v":5.6000000000000005},{"$f":"+'6) INPUT COSTI VARIABILI'!N41","v":6.2},{"$f":"SUM(B110:M110)","v":278.15999999999997},null,{"$f":"+'6) INPUT COSTI VARIABILI'!R41","v":6},{"$f":"+'6) INPUT COSTI VARIABILI'!S41","v":21.7},{"$f":"+'6) INPUT COSTI VARIABILI'!T41","v":48.6},{"$f":"+'6) INPUT COSTI VARIABILI'!U41","v":50.22},{"$f":"+'6) INPUT COSTI VARIABILI'!V41","v":50.22},{"$f":"+'6) INPUT COSTI VARIABILI'!W41","v":21},{"$f":"+'6) INPUT COSTI VARIABILI'!X41","v":6.2},{"$f":"+'6) INPUT COSTI VARIABILI'!Y41","v":6},{"$f":"+'6) INPUT COSTI VARIABILI'!Z41","v":50.22},{"$f":"+'6) INPUT COSTI VARIABILI'!AA41","v":6.2},{"$f":"+'6) INPUT COSTI VARIABILI'!AB41","v":5.6000000000000005},{"$f":"+'6) INPUT COSTI VARIABILI'!AC41","v":6.2},{"$f":"SUM(P110:AA110)","v":278.15999999999997},null,{"$f":"+'6) INPUT COSTI VARIABILI'!AG41","v":6},{"$f":"+'6) INPUT COSTI VARIABILI'!AH41","v":21.7},{"$f":"+'6) INPUT COSTI VARIABILI'!AI41","v":48.6},{"$f":"+'6) INPUT COSTI VARIABILI'!AJ41","v":50.22},{"$f":"+'6) INPUT COSTI VARIABILI'!AK41","v":50.22},{"$f":"+'6) INPUT COSTI VARIABILI'!AL41","v":21},{"$f":"+'6) INPUT COSTI VARIABILI'!AM41","v":6.2},{"$f":"+'6) INPUT COSTI VARIABILI'!AN41","v":6},{"$f":"+'6) INPUT COSTI VARIABILI'!AO41","v":50.22},{"$f":"+'6) INPUT COSTI VARIABILI'!AP41","v":6.2},{"$f":"+'6) INPUT COSTI VARIABILI'!AQ41","v":5.6000000000000005},{"$f":"+'6) INPUT COSTI VARIABILI'!AR41","v":6.2},{"$f":"SUM(AD110:AO110)","v":278.15999999999997}]
[{"$f":"+'6) INPUT COSTI VARIABILI'!B42","v":"Materiale di consumo pulizia"},{"$f":"+'6) INPUT COSTI VARIABILI'!C42","v":6},{"$f":"+'6) INPUT COSTI VARIABILI'!D42","v":21.7},{"$f":"+'6) INPUT COSTI VARIABILI'!E42","v":48.6},{"$f":"+'6) INPUT COSTI VARIABILI'!F42","v":50.22},{"$f":"+'6) INPUT COSTI VARIABILI'!G42","v":50.22},{"$f":"+'6) INPUT COSTI VARIABILI'!H42","v":21},{"$f":"+'6) INPUT COSTI VARIABILI'!I42","v":6.2},{"$f":"+'6) INPUT COSTI VARIABILI'!J42","v":6},{"$f":"+'6) INPUT COSTI VARIABILI'!K42","v":50.22},{"$f":"+'6) INPUT COSTI VARIABILI'!L42","v":6.2},{"$f":"+'6) INPUT COSTI VARIABILI'!M42","v":5.6000000000000005},{"$f":"+'6) INPUT COSTI VARIABILI'!N42","v":6.2},278.15999999999997,null,{"$f":"+'6) INPUT COSTI VARIABILI'!R42","v":6},{"$f":"+'6) INPUT COSTI VARIABILI'!S42","v":21.7},{"$f":"+'6) INPUT COSTI VARIABILI'!T42","v":48.6},{"$f":"+'6) INPUT COSTI VARIABILI'!U42","v":50.22},{"$f":"+'6) INPUT COSTI VARIABILI'!V42","v":50.22},{"$f":"+'6) INPUT COSTI VARIABILI'!W42","v":21},{"$f":"+'6) INPUT COSTI VARIABILI'!X42","v":6.2},{"$f":"+'6) INPUT COSTI VARIABILI'!Y42","v":6},{"$f":"+'6) INPUT COSTI VARIABILI'!Z42","v":50.22},{"$f":"+'6) INPUT COSTI VARIABILI'!AA42","v":6.2},{"$f":"+'6) INPUT COSTI VARIABILI'!AB42","v":5.6000000000000005},{"$f":"+'6) INPUT COSTI VARIABILI'!AC42","v":6.2},278.15999999999997,null,{"$f":"+'6) INPUT COSTI VARIABILI'!AG42","v":6},{"$f":"+'6) INPUT COSTI VARIABILI'!AH42","v":21.7},{"$f":"+'6) INPUT COSTI VARIABILI'!AI42","v":48.6},{"$f":"+'6) INPUT COSTI VARIABILI'!AJ42","v":50.22},{"$f":"+'6) INPUT COSTI VARIABILI'!AK42","v":50.22},{"$f":"+'6) INPUT COSTI VARIABILI'!AL42","v":21},{"$f":"+'6) INPUT COSTI VARIABILI'!AM42","v":6.2},{"$f":"+'6) INPUT COSTI VARIABILI'!AN42","v":6},{"$f":"+'6) INPUT COSTI VARIABILI'!AO42","v":50.22},{"$f":"+'6) INPUT COSTI VARIABILI'!AP42","v":6.2},{"$f":"+'6) INPUT COSTI VARIABILI'!AQ42","v":5.6000000000000005},{"$f":"+'6) INPUT COSTI VARIABILI'!AR42","v":6.2},278.15999999999997]
[{"$f":"+'6) INPUT COSTI VARIABILI'!B43","v":"Servizi di lavanderia"},{"$f":"+'6) INPUT COSTI VARIABILI'!C43","v":30},{"$f":"+'6) INPUT COSTI VARIABILI'!D43","v":108.5},{"$f":"+'6) INPUT COSTI VARIABILI'!E43","v":243},{"$f":"+'6) INPUT COSTI VARIABILI'!F43","v":251.10000000000002},{"$f":"+'6) INPUT COSTI VARIABILI'!G43","v":251.10000000000002},{"$f":"+'6) INPUT COSTI VARIABILI'!H43","v":105},{"$f":"+'6) INPUT COSTI VARIABILI'!I43","v":31},{"$f":"+'6) INPUT COSTI VARIABILI'!J43","v":30},{"$f":"+'6) INPUT COSTI VARIABILI'!K43","v":251.10000000000002},{"$f":"+'6) INPUT COSTI VARIABILI'!L43","v":31},{"$f":"+'6) INPUT COSTI VARIABILI'!M43","v":28},{"$f":"+'6) INPUT COSTI VARIABILI'!N43","v":31},1390.8000000000002,null,{"$f":"+'6) INPUT COSTI VARIABILI'!R43","v":30},{"$f":"+'6) INPUT COSTI VARIABILI'!S43","v":108.5},{"$f":"+'6) INPUT COSTI VARIABILI'!T43","v":243},{"$f":"+'6) INPUT COSTI VARIABILI'!U43","v":251.10000000000002},{"$f":"+'6) INPUT COSTI VARIABILI'!V43","v":251.10000000000002},{"$f":"+'6) INPUT COSTI VARIABILI'!W43","v":105},{"$f":"+'6) INPUT COSTI VARIABILI'!X43","v":31},{"$f":"+'6) INPUT COSTI VARIABILI'!Y43","v":30},{"$f":"+'6) INPUT COSTI VARIABILI'!Z43","v":251.10000000000002},{"$f":"+'6) INPUT COSTI VARIABILI'!AA43","v":31},{"$f":"+'6) INPUT COSTI VARIABILI'!AB43","v":28},{"$f":"+'6) INPUT COSTI VARIABILI'!AC43","v":31},1390.8000000000002,null,{"$f":"+'6) INPUT COSTI VARIABILI'!AG43","v":30},{"$f":"+'6) INPUT COSTI VARIABILI'!AH43","v":108.5},{"$f":"+'6) INPUT COSTI VARIABILI'!AI43","v":243},{"$f":"+'6) INPUT COSTI VARIABILI'!AJ43","v":251.10000000000002},{"$f":"+'6) INPUT COSTI VARIABILI'!AK43","v":251.10000000000002},{"$f":"+'6) INPUT COSTI VARIABILI'!AL43","v":105},{"$f":"+'6) INPUT COSTI VARIABILI'!AM43","v":31},{"$f":"+'6) INPUT COSTI VARIABILI'!AN43","v":30},{"$f":"+'6) INPUT COSTI VARIABILI'!AO43","v":251.10000000000002},{"$f":"+'6) INPUT COSTI VARIABILI'!AP43","v":31},{"$f":"+'6) INPUT COSTI VARIABILI'!AQ43","v":28},{"$f":"+'6) INPUT COSTI VARIABILI'!AR43","v":31},1390.8000000000002]
[{"$f":"+'6) INPUT COSTI VARIABILI'!B44","v":"Visite guidate"},{"$f":"+'6) INPUT COSTI VARIABILI'!C44","v":0},{"$f":"+'6) INPUT COSTI VARIABILI'!D44","v":0},{"$f":"+'6) INPUT COSTI VARIABILI'!E44","v":0},{"$f":"+'6) INPUT COSTI VARIABILI'!F44","v":0},{"$f":"+'6) INPUT COSTI VARIABILI'!G44","v":0},{"$f":"+'6) INPUT COSTI VARIABILI'!H44","v":0},{"$f":"+'6) INPUT COSTI VARIABILI'!I44","v":0},{"$f":"+'6) INPUT COSTI VARIABILI'!J44","v":0},{"$f":"+'6) INPUT COSTI VARIABILI'!K44","v":0},{"$f":"+'6) INPUT COSTI VARIABILI'!L44","v":0},{"$f":"+'6) INPUT COSTI VARIABILI'!M44","v":0},{"$f":"+'6) INPUT COSTI VARIABILI'!N44","v":0},0,null,{"$f":"+'6) INPUT COSTI VARIABILI'!R44","v":0},{"$f":"+'6) INPUT COSTI VARIABILI'!S44","v":0},{"$f":"+'6) INPUT COSTI VARIABILI'!T44","v":0},{"$f":"+'6) INPUT COSTI VARIABILI'!U44","v":0},{"$f":"+'6) INPUT COSTI VARIABILI'!V44","v":0},{"$f":"+'6) INPUT COSTI VARIABILI'!W44","v":0},{"$f":"+'6) INPUT COSTI VARIABILI'!X44","v":0},{"$f":"+'6) INPUT COSTI VARIABILI'!Y44","v":0},{"$f":"+'6) INPUT COSTI VARIABILI'!Z44","v":0},{"$f":"+'6) INPUT COSTI VARIABILI'!AA44","v":0},{"$f":"+'6) INPUT COSTI VARIABILI'!AB44","v":0},{"$f":"+'6) INPUT COSTI VARIABILI'!AC44","v":0},0,null,{"$f":"+'6) INPUT COSTI VARIABILI'!AG44","v":0},{"$f":"+'6) INPUT COSTI VARIABILI'!AH44","v":0},{"$f":"+'6) INPUT COSTI VARIABILI'!AI44","v":0},{"$f":"+'6) INPUT COSTI VARIABILI'!AJ44","v":0},{"$f":"+'6) INPUT COSTI VARIABILI'!AK44","v":0},{"$f":"+'6) INPUT COSTI VARIABILI'!AL44","v":0},{"$f":"+'6) INPUT COSTI VARIABILI'!AM44","v":0},{"$f":"+'6) INPUT COSTI VARIABILI'!AN44","v":0},{"$f":"+'6) INPUT COSTI VARIABILI'!AO44","v":0},{"$f":"+'6) INPUT COSTI VARIABILI'!AP44","v":0},{"$f":"+'6) INPUT COSTI VARIABILI'!AQ44","v":0},{"$f":"+'6) INPUT COSTI VARIABILI'!AR44","v":0},0]
[{"$f":"+'6) INPUT COSTI VARIABILI'!B45","v":"Altri costi variabili"},{"$f":"+'6) INPUT COSTI VARIABILI'!C45","v":0},{"$f":"+'6) INPUT COSTI VARIABILI'!D45","v":0},{"$f":"+'6) INPUT COSTI VARIABILI'!E45","v":0},{"$f":"+'6) INPUT COSTI VARIABILI'!F45","v":0},{"$f":"+'6) INPUT COSTI VARIABILI'!G45","v":0},{"$f":"+'6) INPUT COSTI VARIABILI'!H45","v":0},{"$f":"+'6) INPUT COSTI VARIABILI'!I45","v":0},{"$f":"+'6) INPUT COSTI VARIABILI'!J45","v":0},{"$f":"+'6) INPUT COSTI VARIABILI'!K45","v":0},{"$f":"+'6) INPUT COSTI VARIABILI'!L45","v":0},{"$f":"+'6) INPUT COSTI VARIABILI'!M45","v":0},{"$f":"+'6) INPUT COSTI VARIABILI'!N45","v":0},0,null,{"$f":"+'6) INPUT COSTI VARIABILI'!R45","v":0},{"$f":"+'6) INPUT COSTI VARIABILI'!S45","v":0},{"$f":"+'6) INPUT COSTI VARIABILI'!T45","v":0},{"$f":"+'6) INPUT COSTI VARIABILI'!U45","v":0},{"$f":"+'6) INPUT COSTI VARIABILI'!V45","v":0},{"$f":"+'6) INPUT COSTI VARIABILI'!W45","v":0},{"$f":"+'6) INPUT COSTI VARIABILI'!X45","v":0},{"$f":"+'6) INPUT COSTI VARIABILI'!Y45","v":0},{"$f":"+'6) INPUT COSTI VARIABILI'!Z45","v":0},{"$f":"+'6) INPUT COSTI VARIABILI'!AA45","v":0},{"$f":"+'6) INPUT COSTI VARIABILI'!AB45","v":0},{"$f":"+'6) INPUT COSTI VARIABILI'!AC45","v":0},0,null,{"$f":"+'6) INPUT COSTI VARIABILI'!AG45","v":0},{"$f":"+'6) INPUT COSTI VARIABILI'!AH45","v":0},{"$f":"+'6) INPUT COSTI VARIABILI'!AI45","v":0},{"$f":"+'6) INPUT COSTI VARIABILI'!AJ45","v":0},{"$f":"+'6) INPUT COSTI VARIABILI'!AK45","v":0},{"$f":"+'6) INPUT COSTI VARIABILI'!AL45","v":0},{"$f":"+'6) INPUT COSTI VARIABILI'!AM45","v":0},{"$f":"+'6) INPUT COSTI VARIABILI'!AN45","v":0},{"$f":"+'6) INPUT COSTI VARIABILI'!AO45","v":0},{"$f":"+'6) INPUT COSTI VARIABILI'!AP45","v":0},{"$f":"+'6) INPUT COSTI VARIABILI'!AQ45","v":0},{"$f":"+'6) INPUT COSTI VARIABILI'!AR45","v":0},0]
[{"$f":"+'6) INPUT COSTI VARIABILI'!B46","v":"Altri costi variabili"},{"$f":"+'6) INPUT COSTI VARIABILI'!C46","v":0},{"$f":"+'6) INPUT COSTI VARIABILI'!D46","v":0},{"$f":"+'6) INPUT COSTI VARIABILI'!E46","v":0},{"$f":"+'6) INPUT COSTI VARIABILI'!F46","v":0},{"$f":"+'6) INPUT COSTI VARIABILI'!G46","v":0},{"$f":"+'6) INPUT COSTI VARIABILI'!H46","v":0},{"$f":"+'6) INPUT COSTI VARIABILI'!I46","v":0},{"$f":"+'6) INPUT COSTI VARIABILI'!J46","v":0},{"$f":"+'6) INPUT COSTI VARIABILI'!K46","v":0},{"$f":"+'6) INPUT COSTI VARIABILI'!L46","v":0},{"$f":"+'6) INPUT COSTI VARIABILI'!M46","v":0},{"$f":"+'6) INPUT COSTI VARIABILI'!N46","v":0},0,null,{"$f":"+'6) INPUT COSTI VARIABILI'!R46","v":0},{"$f":"+'6) INPUT COSTI VARIABILI'!S46","v":0},{"$f":"+'6) INPUT COSTI VARIABILI'!T46","v":0},{"$f":"+'6) INPUT COSTI VARIABILI'!U46","v":0},{"$f":"+'6) INPUT COSTI VARIABILI'!V46","v":0},{"$f":"+'6) INPUT COSTI VARIABILI'!W46","v":0},{"$f":"+'6) INPUT COSTI VARIABILI'!X46","v":0},{"$f":"+'6) INPUT COSTI VARIABILI'!Y46","v":0},{"$f":"+'6) INPUT COSTI VARIABILI'!Z46","v":0},{"$f":"+'6) INPUT COSTI VARIABILI'!AA46","v":0},{"$f":"+'6) INPUT COSTI VARIABILI'!AB46","v":0},{"$f":"+'6) INPUT COSTI VARIABILI'!AC46","v":0},0,null,{"$f":"+'6) INPUT COSTI VARIABILI'!AG46","v":0},{"$f":"+'6) INPUT COSTI VARIABILI'!AH46","v":0},{"$f":"+'6) INPUT COSTI VARIABILI'!AI46","v":0},{"$f":"+'6) INPUT COSTI VARIABILI'!AJ46","v":0},{"$f":"+'6) INPUT COSTI VARIABILI'!AK46","v":0},{"$f":"+'6) INPUT COSTI VARIABILI'!AL46","v":0},{"$f":"+'6) INPUT COSTI VARIABILI'!AM46","v":0},{"$f":"+'6) INPUT COSTI VARIABILI'!AN46","v":0},{"$f":"+'6) INPUT COSTI VARIABILI'!AO46","v":0},{"$f":"+'6) INPUT COSTI VARIABILI'!AP46","v":0},{"$f":"+'6) INPUT COSTI VARIABILI'!AQ46","v":0},{"$f":"+'6) INPUT COSTI VARIABILI'!AR46","v":0},0]
[{"$f":"+'6) INPUT COSTI VARIABILI'!B47","v":"Altri costi variabili"},{"$f":"+'6) INPUT COSTI VARIABILI'!C47","v":0},{"$f":"+'6) INPUT COSTI VARIABILI'!D47","v":0},{"$f":"+'6) INPUT COSTI VARIABILI'!E47","v":0},{"$f":"+'6) INPUT COSTI VARIABILI'!F47","v":0},{"$f":"+'6) INPUT COSTI VARIABILI'!G47","v":0},{"$f":"+'6) INPUT COSTI VARIABILI'!H47","v":0},{"$f":"+'6) INPUT COSTI VARIABILI'!I47","v":0},{"$f":"+'6) INPUT COSTI VARIABILI'!J47","v":0},{"$f":"+'6) INPUT COSTI VARIABILI'!K47","v":0},{"$f":"+'6) INPUT COSTI VARIABILI'!L47","v":0},{"$f":"+'6) INPUT COSTI VARIABILI'!M47","v":0},{"$f":"+'6) INPUT COSTI VARIABILI'!N47","v":0},0,null,{"$f":"+'6) INPUT COSTI VARIABILI'!R47","v":0},{"$f":"+'6) INPUT COSTI VARIABILI'!S47","v":0},{"$f":"+'6) INPUT COSTI VARIABILI'!T47","v":0},{"$f":"+'6) INPUT COSTI VARIABILI'!U47","v":0},{"$f":"+'6) INPUT COSTI VARIABILI'!V47","v":0},{"$f":"+'6) INPUT COSTI VARIABILI'!W47","v":0},{"$f":"+'6) INPUT COSTI VARIABILI'!X47","v":0},{"$f":"+'6) INPUT COSTI VARIABILI'!Y47","v":0},{"$f":"+'6) INPUT COSTI VARIABILI'!Z47","v":0},{"$f":"+'6) INPUT COSTI VARIABILI'!AA47","v":0},{"$f":"+'6) INPUT COSTI VARIABILI'!AB47","v":0},{"$f":"+'6) INPUT COSTI VARIABILI'!AC47","v":0},0,null,{"$f":"+'6) INPUT COSTI VARIABILI'!AG47","v":0},{"$f":"+'6) INPUT COSTI VARIABILI'!AH47","v":0},{"$f":"+'6) INPUT COSTI VARIABILI'!AI47","v":0},{"$f":"+'6) INPUT COSTI VARIABILI'!AJ47","v":0},{"$f":"+'6) INPUT COSTI VARIABILI'!AK47","v":0},{"$f":"+'6) INPUT COSTI VARIABILI'!AL47","v":0},{"$f":"+'6) INPUT COSTI VARIABILI'!AM47","v":0},{"$f":"+'6) INPUT COSTI VARIABILI'!AN47","v":0},{"$f":"+'6) INPUT COSTI VARIABILI'!AO47","v":0},{"$f":"+'6) INPUT COSTI VARIABILI'!AP47","v":0},{"$f":"+'6) INPUT COSTI VARIABILI'!AQ47","v":0},{"$f":"+'6) INPUT COSTI VARIABILI'!AR47","v":0},0]
[{"$f":"+'6) INPUT COSTI VARIABILI'!B48","v":"Altri costi variabili"},{"$f":"+'6) INPUT COSTI VARIABILI'!C48","v":0},{"$f":"+'6) INPUT COSTI VARIABILI'!D48","v":0},{"$f":"+'6) INPUT COSTI VARIABILI'!E48","v":0},{"$f":"+'6) INPUT COSTI VARIABILI'!F48","v":0},{"$f":"+'6) INPUT COSTI VARIABILI'!G48","v":0},{"$f":"+'6) INPUT COSTI VARIABILI'!H48","v":0},{"$f":"+'6) INPUT COSTI VARIABILI'!I48","v":0},{"$f":"+'6) INPUT COSTI VARIABILI'!J48","v":0},{"$f":"+'6) INPUT COSTI VARIABILI'!K48","v":0},{"$f":"+'6) INPUT COSTI VARIABILI'!L48","v":0},{"$f":"+'6) INPUT COSTI VARIABILI'!M48","v":0},{"$f":"+'6) INPUT COSTI VARIABILI'!N48","v":0},0,null,{"$f":"+'6) INPUT COSTI VARIABILI'!R48","v":0},{"$f":"+'6) INPUT COSTI VARIABILI'!S48","v":0},{"$f":"+'6) INPUT COSTI VARIABILI'!T48","v":0},{"$f":"+'6) INPUT COSTI VARIABILI'!U48","v":0},{"$f":"+'6) INPUT COSTI VARIABILI'!V48","v":0},{"$f":"+'6) INPUT COSTI VARIABILI'!W48","v":0},{"$f":"+'6) INPUT COSTI VARIABILI'!X48","v":0},{"$f":"+'6) INPUT COSTI VARIABILI'!Y48","v":0},{"$f":"+'6) INPUT COSTI VARIABILI'!Z48","v":0},{"$f":"+'6) INPUT COSTI VARIABILI'!AA48","v":0},{"$f":"+'6) INPUT COSTI VARIABILI'!AB48","v":0},{"$f":"+'6) INPUT COSTI VARIABILI'!AC48","v":0},0,null,{"$f":"+'6) INPUT COSTI VARIABILI'!AG48","v":0},{"$f":"+'6) INPUT COSTI VARIABILI'!AH48","v":0},{"$f":"+'6) INPUT COSTI VARIABILI'!AI48","v":0},{"$f":"+'6) INPUT COSTI VARIABILI'!AJ48","v":0},{"$f":"+'6) INPUT COSTI VARIABILI'!AK48","v":0},{"$f":"+'6) INPUT COSTI VARIABILI'!AL48","v":0},{"$f":"+'6) INPUT COSTI VARIABILI'!AM48","v":0},{"$f":"+'6) INPUT COSTI VARIABILI'!AN48","v":0},{"$f":"+'6) INPUT COSTI VARIABILI'!AO48","v":0},{"$f":"+'6) INPUT COSTI VARIABILI'!AP48","v":0},{"$f":"+'6) INPUT COSTI VARIABILI'!AQ48","v":0},{"$f":"+'6) INPUT COSTI VARIABILI'!AR48","v":0},0]
["USCITE VARIABILI",{"$f":"SUM(B109:B117)","v":78},{"$f":"SUM(C109:C117)","v":244.9},{"$f":"SUM(D109:D117)","v":502.2},518.94000000000005,518.94000000000005,237,80.600000000000009,78,518.94000000000005,80.600000000000009,72.800000000000011,80.600000000000009,3011.52,null,78,244.9,502.2,518.94000000000005,518.94000000000005,237,80.600000000000009,78,518.94000000000005,80.600000000000009,72.800000000000011,80.600000000000009,3011.52,null,78,244.9,502.2,518.94000000000005,518.94000000000005,237,80.600000000000009,78,518.94000000000005,80.600000000000009,72.800000000000011,80.600000000000009,3011.52]
[]
[null,{"$f":"+B108","v":"2016-04-30"},{"$f":"+C108","v":"2016-05-31"},"2016-06-30","2016-07-31","2016-08-31","2016-09-30","2016-10-31","2016-11-30","2016-12-31","2017-01-31","2017-02-28","2017-03-31","TOTALE",null,"2017-04-30","2017-05-31","2017-06-30","2017-07-31","2017-08-31","2017-09-30","2017-10-31","2017-11-30","2017-12-31","2018-01-31","2018-02-28","2018-03-31","TOTALE",null,"2018-04-30","2018-05-31","2018-06-30","2018-07-31","2018-08-31","2018-09-30","2018-10-31","2018-11-30","2018-12-31","2019-01-31","2019-02-28","2019-03-31","TOTALE"]
["IMPOSTE SUI REDDITI",{"$f":"_xlfn.IFNA(VLOOKUP(B120,'8) OUTPUT TASSAZIONE'!$B$20:$C$27,2,FALSE),0)","v":0},{"$f":"_xlfn.IFNA(VLOOKUP(C120,'8) OUTPUT TASSAZIONE'!$B$20:$C$27,2,FALSE),0)","v":0},{"$f":"_xlfn.IFNA(VLOOKUP(D120,'8) OUTPUT TASSAZIONE'!$B$20:$C$27,2,FALSE),0)","v":0},{"$f":"_xlfn.IFNA(VLOOKUP(E120,'8) OUTPUT TASSAZIONE'!$B$20:$C$27,2,FALSE),0)","v":0},{"$f":"_xlfn.IFNA(VLOOKUP(F120,'8) OUTPUT TASSAZIONE'!$B$20:$C$27,2,FALSE),0)","v":0},{"$f":"_xlfn.IFNA(VLOOKUP(G120,'8) OUTPUT TASSAZIONE'!$B$20:$C$27,2,FALSE),0)","v":0},{"$f":"_xlfn.IFNA(VLOOKUP(H120,'8) OUTPUT TASSAZIONE'!$B$20:$C$27,2,FALSE),0)","v":0},{"$f":"_xlfn.IFNA(VLOOKUP(I120,'8) OUTPUT TASSAZIONE'!$B$20:$C$27,2,FALSE),0)","v":0},{"$f":"_xlfn.IFNA(VLOOKUP(J120,'8) OUTPUT TASSAZIONE'!$B$20:$C$27,2,FALSE),0)","v":0},{"$f":"_xlfn.IFNA(VLOOKUP(K120,'8) OUTPUT TASSAZIONE'!$B$20:$C$27,2,FALSE),0)","v":0},{"$f":"_xlfn.IFNA(VLOOKUP(L120,'8) OUTPUT TASSAZIONE'!$B$20:$C$27,2,FALSE),0)","v":0},{"$f":"_xlfn.IFNA(VLOOKUP(M120,'8) OUTPUT TASSAZIONE'!$B$20:$C$27,2,FALSE),0)","v":0},{"$f":"SUM(B121:M121)","v":0},null,{"$f":"_xlfn.IFNA(VLOOKUP(P120,'8) OUTPUT TASSAZIONE'!$B$20:$C$27,2,FALSE),0)","v":0},{"$f":"_xlfn.IFNA(VLOOKUP(Q120,'8) OUTPUT TASSAZIONE'!$B$20:$C$27,2,FALSE),0)","v":0},{"$f":"_xlfn.IFNA(VLOOKUP(R120,'8) OUTPUT TASSAZIONE'!$B$20:$C$27,2,FALSE),0)","v":728.44800000000009},{"$f":"_xlfn.IFNA(VLOOKUP(S120,'8) OUTPUT TASSAZIONE'!$B$20:$C$27,2,FALSE),0)","v":0},{"$f":"_xlfn.IFNA(VLOOKUP(T120,'8) OUTPUT TASSAZIONE'!$B$20:$C$27,2,FALSE),0)","v":0},{"$f":"_xlfn.IFNA(VLOOKUP(U120,'8) OUTPUT TASSAZIONE'!$B$20:$C$27,2,FALSE),0)","v":0},{"$f":"_xlfn.IFNA(VLOOKUP(V120,'8) OUTPUT TASSAZIONE'!$B$20:$C$27,2,FALSE),0)","v":0},{"$f":"_xlfn.IFNA(VLOOKUP(W120,'8) OUTPUT TASSAZIONE'!$B$20:$C$27,2,FALSE),0)","v":312.19200000000001},{"$f":"_xlfn.IFNA(VLOOKUP(X120,'8) OUTPUT TASSAZIONE'!$B$20:$C$27,2,FALSE),0)","v":0},{"$f":"_xlfn.IFNA(VLOOKUP(Y120,'8) OUTPUT TASSAZIONE'!$B$20:$C$27,2,FALSE),0)","v":0},{"$f":"_xlfn.IFNA(VLOOKUP(Z120,'8) OUTPUT TASSAZIONE'!$B$20:$C$27,2,FALSE),0)","v":0},{"$f":"_xlfn.IFNA(VLOOKUP(AA120,'8) OUTPUT TASSAZIONE'!$B$20:$C$27,2,FALSE),0)","v":0},{"$f":"SUM(P121:AA121)","v":1040.6400000000001},null,{"$f":"_xlfn.IFNA(VLOOKUP(AD120,'8) OUTPUT TASSAZIONE'!$B$20:$C$27,2,FALSE),0)","v":0},{"$f":"_xlfn.IFNA(VLOOKUP(AE120,'8) OUTPUT TASSAZIONE'!$B$20:$C$27,2,FALSE),0)","v":0},{"$f":"_xlfn.IFNA(VLOOKUP(AF120,'8) OUTPUT TASSAZIONE'!$B$20:$C$27,2,FALSE),0)","v":50.4},{"$f":"_xlfn.IFNA(VLOOKUP(AG120,'8) OUTPUT TASSAZIONE'!$B$20:$C$27,2,FALSE),0)","v":0},{"$f":"_xlfn.IFNA(VLOOKUP(AH120,'8) OUTPUT TASSAZIONE'!$B$20:$C$27,2,FALSE),0)","v":0},{"$f":"_xlfn.IFNA(VLOOKUP(AI120,'8) OUTPUT TASSAZIONE'!$B$20:$C$27,2,FALSE),0)","v":0},{"$f":"_xlfn.IFNA(VLOOKUP(AJ120,'8) OUTPUT TASSAZIONE'!$B$20:$C$27,2,FALSE),0)","v":0},{"$f":"_xlfn.IFNA(VLOOKUP(AK120,'8) OUTPUT TASSAZIONE'!$B$20:$C$27,2,FALSE),0)","v":21.599999999999998},{"$f":"_xlfn.IFNA(VLOOKUP(AL120,'8) OUTPUT TASSAZIONE'!$B$20:$C$27,2,FALSE),0)","v":0},{"$f":"_xlfn.IFNA(VLOOKUP(AM120,'8) OUTPUT TASSAZIONE'!$B$20:$C$27,2,FALSE),0)","v":0},{"$f":"_xlfn.IFNA(VLOOKUP(AN120,'8) OUTPUT TASSAZIONE'!$B$20:$C$27,2,FALSE),0)","v":0},{"$f":"_xlfn.IFNA(VLOOKUP(AO120,'8) OUTPUT TASSAZIONE'!$B$20:$C$27,2,FALSE),0)","v":0},{"$f":"SUM(AD121:AO121)","v":72}]
[]
["UNLEVERED",{"$f":"+B120","v":"2016-04-30"},{"$f":"+C120","v":"2016-05-31"},"2016-06-30","2016-07-31","2016-08-31","2016-09-30","2016-10-31","2016-11-30","2016-12-31","2017-01-31","2017-02-28","2017-03-31","TOTALE",null,"2017-04-30","2017-05-31","2017-06-30","2017-07-31","2017-08-31","2017-09-30","2017-10-31","2017-11-30","2017-12-31","2018-01-31","2018-02-28","2018-03-31","TOTALE",null,"2018-04-30","2018-05-31","2018-06-30","2018-07-31","2018-08-31","2018-09-30","2018-10-31","2018-11-30","2018-12-31","2019-01-31","2019-02-28","2019-03-31","TOTALE"]
["CASH FLOW",{"$f":"+B17-B69-B106-B118-B121","v":0},{"$f":"+C17-C69-C106-C118-C121","v":1535.1},{"$f":"+D17-D69-D106-D118-D121","v":4127.8},4063.06,4273.0599999999995,1473,259.39999999999998,132,4273.0599999999995,99.399999999999991,257.2,{"$f":"+M17-M69-M106-M118-M121","v":-9.9475983006414026E-14},{"$f":"SUM(B124:M124)","v":20493.079999999998},null,{"$f":"+P17-P69-P106-P118-P121","v":0},{"$f":"+Q17-Q69-Q106-Q118-Q121","v":1535.1},3399.3519999999999,4063.06,4273.0599999999995,1473,259.39999999999998,0,4273.0599999999995,99.399999999999991,{"$f":"+Z17-Z69-Z106-Z118-Z121","v":257.2},-9.9475983006414026E-14,{"$f":"SUM(P124:AA124)","v":19632.632000000001},null,{"$f":"+AD17-AD69-AD106-AD118-AD121","v":0},{"$f":"+AE17-AE69-AE106-AE118-AE121","v":1535.1},4077.4,4063.06,4273.0599999999995,1473,259.39999999999998,110.4,4273.0599999999995,99.399999999999991,257.2,-9.9475983006414026E-14,{"$f":"SUM(AC124:AO124)","v":20421.079999999998}]
[]
["OPZIONE CAPITALE","SI COMPENSA FLUSSI NEGATIVI CON CAPITALE"]
["FABBISOGNO DI CAPIALE",{"$f":"+B16","v":7608},0,0,0,0,0,0,0,0,0,0,600.6,8208.6,0,8,0,0,0,0,0,0,180.19200000000001,0,0,0,600.6,788.79200000000003,0,8,0,0,0,0,0,0,0,0,0,0,600.6,608.6]
[]
["Consiglio: si consiglia inizialemtne di impostare su LEVERED e NO NON COMPENSARE FLUSSI NEGATIVI CON CAPITALE, così sarà possibile evidenziare i risultati in funzione delle ipotesi inserite nel foglio INPUT finanziamento. Successivamente si possono effettuare le altre combinazione di ipotesi, ad esempio si può verificare il capitale necessario a compensare i flussi negativi in situazione levered, oppure in assenza di capitale di terzi."]
[]
[]
[]
[null,null,"GENERA SCENARI - è una macro che consente di creare un fogli in cui sono riepilocati i flussi di cassa annuali e il fabbisogno di capitale,"]
[null,null,"nelle 4 opzioni possibili: LEVERED - SENZA COMPENSAZIONE, LEVERED - CON COMPENSAZIONE, UNLEVERED - SENZA COMPENSAZIONE,"]
[null,null,"UNLEVERED - CON COMPENSAZIONE."]
[null,null,"IMPORTANTE: prima di generare un nuovo riepilogo scenari, bisogna cancellare il foglio del precedente riepilogo."]